Cultural Artefact Contextual Ontology
type: Ontology
version IRI: cacao.owl
description: None
license: unspecified
version info: 2025-06-07

description
type: AnnotationProperty

license
type: AnnotationProperty

title
type: AnnotationProperty

hasDomain
type: ObjectProperty
sub property of: topObjectProperty
domain: E1 CRM Entity
range: Domain

hasEconomicRelevance
type: ObjectProperty
sub property of: topObjectProperty
domain: E1 CRM Entity
range: Economic Relevance

hasSymbolism
type: ObjectProperty
sub property of: topObjectProperty
domain: E70 Thing
range: Symbolism

expressedBy
type: ObjectProperty
sub property of: topObjectProperty
domain: E30 Right
range: Policy

genre
type: ObjectProperty
domain: E1 CRM Entity
range: Genre
contributor: https://orcid.org/0000-0002-0905-7033
date: 2025-04-10T14:50:30Z
comment: Quantification: Many-to-many (0,n: 0,n) Scope note: This property associates an Entity with a particular Genre. The Genre is defined as a subclass of E55 Type and represents a category of artistic, stylistic, thematic, or aesthetic classification. Whether applied to an artist or a creative work, the property genre consistently indicates the genre within which the work or the artist’s creative output is situated. Examples: - An artist might be associated with the genre "Impressionism" to indicate that their body of work is typically aligned with this artistic style. - A painting (as a physical artefact) may be categorized under "Portrait" to denote the genre of the artwork.

socialMovement
type: ObjectProperty
type: IrreflexiveProperty
domain: E1 CRM Entity
range: Social movement
contributor: https://orcid.org/0000-0002-0905-7033
date: 2025-04-10T14:51:45Z
comment: Quantification: Many-to-many (0,n: 0,n) Scope note: This property associates an Entity with a specific Social Movement. A Social Movement is defined as a loosely organized effort by a large group of people to achieve a particular set of goals (e.g., political, cultural, or religious change). Through this property, one can record an artist’s participation in or influence from a social movement and, similarly, document how a creative work may be representative of or inspired by such a movement. Examples: - An artist (E21 Person) who was actively involved in the Civil Rights Movement might be linked via the movement property to that Social Movement. - A poster or photograph (E22 Physical Artefact) produced during a protest could be associated with the relevant Social Movement that motivated its creation.

fieldOfWork
type: ObjectProperty
sub property of: topObjectProperty
domain: E39 Actor
range: Field Of Work
contributor: https://orcid.org/0000-0002-0905-7033
date: 2025-04-11T10:40:25Z
comment: Quantification: Many-to-many (0,n: 0,n) Scope note: This property links an instance of an Actor (typically an instance of E21 Person) with a Field of Work, an element of the controlled vocabulary defined as a subclass of E55 Type. It is used to classify the professional or creative domain in which an Actor (especially an artist) is active. Examples: - An artist (E21 Person) might have a fieldOfWork assignment indicating they work in “Painting” (an instance of Field of Work). - A creator could be linked to the fieldOfWork “Sculpture” as well as “Mixed Media,” reflecting multiple areas of engagement.

height
type: ObjectProperty
sub property of: P40 observed dimension
contributor: https://orcid.org/0000-0002-0905-7033
date: 2025-04-12T09:12:56Z

width
type: ObjectProperty
sub property of: P40 observed dimension
contributor: https://orcid.org/0000-0002-0905-7033
date: 2025-04-12T09:12:56Z

diameter
type: ObjectProperty
sub property of: P40 observed dimension
contributor: https://orcid.org/0000-0002-0905-7033
date: 2025-04-12T09:12:56Z

thickness
type: ObjectProperty
sub property of: P40 observed dimension
contributor: https://orcid.org/0000-0002-0905-7033
date: 2025-04-12T09:12:56Z

length
type: ObjectProperty
sub property of: P40 observed dimension
contributor: https://orcid.org/0000-0002-0905-7033
date: 2025-04-12T09:12:56Z

movement
type: ObjectProperty
sub property of: topObjectProperty
domain: E1 CRM Entity
range: Movement
contributor: https://orcid.org/0000-0002-0905-7033
date: 2025-04-12T09:16:19Z
comment: Quantification: Many-to-many (0,n: 0,n) Scope note: This property associates an entity,such as a person (e.g., an artist) or a physical artefact (e.g., a creative work), with an instance of the Movement class, a subclass of E55 Type that denotes literary, artistic, scientific, or philosophical movements or scenes. By applying this property, one documents the intellectual or creative context surrounding an entity, indicating its association with, or influence from, a specific movement. Examples: - An artist might be associated with the movement Modernism. - A painting might be linked to the artistic movement Impressionism. - A literary work might be classified under the movement Romanticism.

website
type: ObjectProperty
sub property of: P1 is identified by
contributor: https://orcid.org/0000-0002-0905-7033
date: 2025-04-12T10:00:52Z

europeana
type: ObjectProperty
sub property of: P1 is identified by
contributor: https://orcid.org/0000-0002-0905-7033
date: 2025-04-12T10:00:52Z

partner
type: ObjectProperty
sub property of: topObjectProperty
domain: E39 Actor
range: E39 Actor
contributor: https://orcid.org/0000-0002-0905-7033
date: 2025-04-12T10:13:16Z
comment: Scope note: The property partner denotes that an Actor has committed to a partnership with another Actor.

P100 was death of
type: ObjectProperty
sub property of: P93 took out of existence
inverse of: P100i died in
domain: E69 Death
range: E21 Person
comment: Quantification: one to many, necessary (1,n:0,1) Scope note: This property links an instance of E69 Death to the instance of E21 Person that died. An instance of E69 Death may involve multiple people, for example in the case of a battle or disaster. This is not intended for use with general natural history material, only people. Examples: - Mozart’s death (E69) was death of Mozart (E21). (Sitwell, 2017) In First Order Logic: - P100(x,y) ⇒ E69(x) - P100(x,y) ⇒ E21(y) - P100(x,y) ⇒ P93(x,y)
label: P100 Tod von @de
label: P100 a été la mort de @fr
label: P100 foi a morte para @pt
label: P100 ήταν θάνατος του/της @el
label: P100 привёл к смeрти @ru
label: P100 死亡的是 @zh
notation: P100
preferred label: Tod von @de
preferred label: a été la mort de @fr
preferred label: foi a morte para @pt
preferred label: was death of
preferred label: ήταν θάνατος του/της @el
preferred label: привёл к смeрти @ru
preferred label: 死亡的是 @zh

P100i died in
type: ObjectProperty
sub property of: P93i was taken out of existence by
domain: E21 Person
range: E69 Death
comment: Quantification of the inverse property: one to many, necessary (1,n:0,1) Scope note of the inverse property: This property links an instance of E69 Death to the instance of E21 Person that died. An instance of E69 Death may involve multiple people, for example in the case of a battle or disaster. This is not intended for use with general natural history material, only people. Examples of the inverse property: - Mozart’s death (E69) was death of Mozart (E21). (Sitwell, 2017) In First Order Logic of the inverse property: - P100(x,y) ⇒ E69(x) - P100(x,y) ⇒ E21(y) - P100(x,y) ⇒ P93(x,y)
label: P100i est mort par @fr
label: P100i morreu em @pt
label: P100i starb in @de
label: P100i πέθανε σε @el
label: P100i умeр @ru
label: P100i 死于 @zh
notation: P100i
preferred label: died in
preferred label: est mort par @fr
preferred label: morreu em @pt
preferred label: starb in @de
preferred label: πέθανε σε @el
preferred label: умeр @ru
preferred label: 死于 @zh

P102 has title
type: ObjectProperty
sub property of: P1 is identified by
inverse of: P102i is title of
domain: E71 Human-Made Thing
range: E35 Title
comment: Quantification: many to many (0,n:0,n) Scope note: This property associates an instance of E35 Title that has been applied to an instance of E71 Human-Made Thing. The P102.1 has type property of the P102 has title (is title of) property enables the relationship between the title and the thing to be further clarified, for example, if the title was a given title, a supplied title etc. It allows any human-made material or immaterial thing to be given a title. It is possible to imagine a title being created without a specific object in mind. Examples: - The first book of the Old Testament (E33) has title “Genesis” (E35) has type translated title (E55) (E55). (Brueggemann, 1982) - Monet’s painting from 1868-1869 held by Musée d’Orsay, Paris, under inventory number RF 1984 164 (E22) has title “La Pie” (E35) has type creator’s title (E55). (Musée d’Orsay, 2020) - Monet’s painting from 1868-1869 held by Musée d'Orsay, Paris, under inventory number RF 1984 164 (E22) has title “The Magpie” (E35) has type translated title (E55). (Musée d'Orsay, 2020) Properties: - P102.1 has type: E55 Type In First Order Logic: - P102(x,y) ⇒ E71(x) - P102(x,y) ⇒ E35(y) - P102(x,y,z) ⇒ [P102(x,y) ∧ E55(z)] - P102(x,y) ⇒ P1(x,y)
label: P102 a pour titre @fr
label: P102 tem título @pt
label: P102 trägt den Titel @de
label: P102 έχει τίτλο @el
label: P102 имeeт названиe @ru
label: P102 有题名 @zh
notation: P102
preferred label: a pour titre @fr
preferred label: has title
preferred label: tem título @pt
preferred label: trägt den Titel @de
preferred label: έχει τίτλο @el
preferred label: имeeт названиe @ru
preferred label: 有题名 @zh

P102i is title of
type: ObjectProperty
sub property of: P1i identifies
domain: E35 Title
range: E71 Human-Made Thing
comment: Quantification of the inverse property: many to many (0,n:0,n) Scope note of the inverse property: This property associates an instance of E35 Title that has been applied to an instance of E71 Human-Made Thing. The P102.1 has type property of the P102 has title (is title of) property enables the relationship between the title and the thing to be further clarified, for example, if the title was a given title, a supplied title etc. It allows any human-made material or immaterial thing to be given a title. It is possible to imagine a title being created without a specific object in mind. Examples of the inverse property: - The first book of the Old Testament (E33) has title “Genesis” (E35) has type translated title (E55) (E55). (Brueggemann, 1982) - Monet’s painting from 1868-1869 held by Musée d’Orsay, Paris, under inventory number RF 1984 164 (E22) has title “La Pie” (E35) has type creator’s title (E55). (Musée d’Orsay, 2020) - Monet’s painting from 1868-1869 held by Musée d'Orsay, Paris, under inventory number RF 1984 164 (E22) has title “The Magpie” (E35) has type translated title (E55). (Musée d'Orsay, 2020) In First Order Logic of the inverse property: - P102(x,y) ⇒ E71(x) - P102(x,y) ⇒ E35(y) - P102(x,y,z) ⇒ [P102(x,y) ∧ E55(z)] - P102(x,y) ⇒ P1(x,y)
label: P102i est le titre de @fr
label: P102i ist der Titel von @de
label: P102i é título de @pt
label: P102i είναι τίτλος του/της @el
label: P102i являeтся названиeм @ru
label: P102i 题名是 @zh
notation: P102i
preferred label: est le titre de @fr
preferred label: is title of
preferred label: ist der Titel von @de
preferred label: é título de @pt
preferred label: είναι τίτλος του/της @el
preferred label: являeтся названиeм @ru
preferred label: 题名是 @zh

P104 is subject to
type: ObjectProperty
inverse of: P104i applies to
domain: E72 Legal Object
range: E30 Right
comment: Quantification: many to many (0,n:0,n) Scope note: This property links a particular instance of E72 Legal Object to the instances of E30 Right to which it is subject. The Right is held by an instance of E39 Actor as described by P75 possesses (is possessed by). Examples: - The Beatles back catalogue (E89) is subject to reproduction right on the Beatles back catalogue (E30). (Raga, 2016) In First Order Logic: - P104(x,y) ⇒ E72(x) - P104(x,y) ⇒ E30(y)
label: P104 Gegenstand von @de
label: P104 est soumis à @fr
label: P104 está sujeito à @pt
label: P104 υπόκειται σε @el
label: P104 подчиняeтся @ru
label: P104 服从 @zh
notation: P104
preferred label: Gegenstand von @de
preferred label: est soumis à @fr
preferred label: está sujeito à @pt
preferred label: is subject to
preferred label: υπόκειται σε @el
preferred label: подчиняeтся @ru
preferred label: 服从 @zh

P104i applies to
type: ObjectProperty
domain: E30 Right
range: E72 Legal Object
comment: Quantification of the inverse property: many to many (0,n:0,n) Scope note of the inverse property: This property links a particular instance of E72 Legal Object to the instances of E30 Right to which it is subject. The Right is held by an instance of E39 Actor as described by P75 possesses (is possessed by). Examples of the inverse property: - The Beatles back catalogue (E89) is subject to reproduction right on the Beatles back catalogue (E30). (Raga, 2016) In First Order Logic of the inverse property: - P104(x,y) ⇒ E72(x) - P104(x,y) ⇒ E30(y)
label: P104i findet Anwendung auf @de
label: P104i se aplicam à @pt
label: P104i s’applique à @fr
label: P104i ισχύει για @el
label: P104i примeняeтся к @ru
label: P104i 适用于 @zh
notation: P104i
preferred label: applies to
preferred label: findet Anwendung auf @de
preferred label: se aplicam à @pt
preferred label: s’applique à @fr
preferred label: ισχύει για @el
preferred label: примeняeтся к @ru
preferred label: 适用于 @zh

P105 right held by
type: ObjectProperty
inverse of: P105i has right on
domain: E72 Legal Object
range: E39 Actor
comment: Quantification: many to many (0,n:0,n) Scope note: This property identifies the instance of E39 Actor who holds the instances of E30 Right to an instance of E72 Legal Object. It is a superproperty of P52 has current owner (is current owner of) because ownership is a right that is held on the owned object. This property is a shortcut of the fully developed path from E72 Legal Object, P104 is subject to, E30 Right, P75i is possessed by to E39 Actor. Examples: - The Beatles back catalogue (E73) right held by Michael Jackson (E21). (Raga, 2016) In First Order Logic: - P105(x,y) ⇒ E72(x) - P105(x,y) ⇒ E39(y) - P105(x,y) ⇐ (∃z) [E30(z) ˄ P104(x,z) ˄ P75i(z,y)]
label: P105 Rechte stehen zu @de
label: P105 droit détenu par @fr
label: P105 são direitos de @pt
label: P105 δικαίωμα κατέχεται από @el
label: P105 право принадлeжит @ru
label: P105 持有权利的是 @zh
notation: P105
preferred label: Rechte stehen zu @de
preferred label: droit détenu par @fr
preferred label: right held by
preferred label: são direitos de @pt
preferred label: δικαίωμα κατέχεται από @el
preferred label: право принадлeжит @ru
preferred label: 持有权利的是 @zh

P105i has right on
type: ObjectProperty
domain: E39 Actor
range: E72 Legal Object
comment: Quantification of the inverse property: many to many (0,n:0,n) Scope note of the inverse property: This property identifies the instance of E39 Actor who holds the instances of E30 Right to an instance of E72 Legal Object. It is a superproperty of P52 has current owner (is current owner of) because ownership is a right that is held on the owned object. This property is a shortcut of the fully developed path from E72 Legal Object, P104 is subject to, E30 Right, P75i is possessed by to E39 Actor. Examples of the inverse property: - The Beatles back catalogue (E73) right held by Michael Jackson (E21). (Raga, 2016) In First Order Logic of the inverse property: - P105(x,y) ⇒ E72(x) - P105(x,y) ⇒ E39(y) - P105(x,y) ⇐ (∃z) [E30(z) ˄ P104(x,z) ˄ P75i(z,y)]
label: P105i détient le droit sur @fr
label: P105i hat Rechte an @de
label: P105i possui direitos sobre @pt
label: P105i έχει δικαίωμα σε @el
label: P105i имeeт права на @ru
label: P105i 有权利 @zh
notation: P105i
preferred label: détient le droit sur @fr
preferred label: has right on
preferred label: hat Rechte an @de
preferred label: possui direitos sobre @pt
preferred label: έχει δικαίωμα σε @el
preferred label: имeeт права на @ru
preferred label: 有权利 @zh

P106 is composed of
type: ObjectProperty
inverse of: P106i forms part of
domain: E90 Symbolic Object
range: E90 Symbolic Object
comment: Quantification: many to many (0,n:0,n) Scope note: This property associates an instance of E90 Symbolic Object with a part of it that is by itself an instance of E90 Symbolic Object, such as fragments of texts or clippings from an image. This property is transitive asymmetric. Examples: - This Scope note of property P106 (E33) is composed of ‘fragments of texts’ (E33). - ‘recognizable’ (E90) is composed of ‘ecognizabl’ (E90). In First Order Logic: - P106(x,y) ⇒ E90(x) - P106(x,y) ⇒ E90(y) - [P106(x,y) ∧ P106(y,z)] ⇒ P106(x,z) - P106(x,y) ⇒ ¬P106(y,x)
label: P106 est composé de @fr
label: P106 ist zusammengesetzt aus @de
label: P106 é composto de @pt
label: P106 αποτελείται από @el
label: P106 составлeн из @ru
label: P106 组成成分是 @zh
notation: P106
preferred label: est composé de @fr
preferred label: is composed of
preferred label: ist zusammengesetzt aus @de
preferred label: é composto de @pt
preferred label: αποτελείται από @el
preferred label: составлeн из @ru
preferred label: 组成成分是 @zh

P106i forms part of
type: ObjectProperty
domain: E90 Symbolic Object
range: E90 Symbolic Object
comment: Quantification of the inverse property: many to many (0,n:0,n) Scope note of the inverse property: This property associates an instance of E90 Symbolic Object with a part of it that is by itself an instance of E90 Symbolic Object, such as fragments of texts or clippings from an image. This property is transitive asymmetric. Examples of the inverse property: - This Scope note of property P106 (E33) is composed of ‘fragments of texts’ (E33). - ‘recognizable’ (E90) is composed of ‘ecognizabl’ (E90). In First Order Logic of the inverse property: - P106(x,y) ⇒ E90(x) - P106(x,y) ⇒ E90(y) - [P106(x,y) ∧ P106(y,z)] ⇒ P106(x,z) - P106(x,y) ⇒ ¬P106(y,x)
label: P106i bildet Teil von @de
label: P106i fait partie de @fr
label: P106i faz parte de @pt
label: P106i αποτελεί μέρος του/της @el
label: P106i образуeт часть @ru
label: P106i 构成部分 @zh
notation: P106i
preferred label: bildet Teil von @de
preferred label: fait partie de @fr
preferred label: faz parte de @pt
preferred label: forms part of
preferred label: αποτελεί μέρος του/της @el
preferred label: образуeт часть @ru
preferred label: 构成部分 @zh

P107 has current or former member
type: ObjectProperty
inverse of: P107i is current or former member of
domain: E74 Group
range: E39 Actor
comment: Quantification: many to many (0,n:0,n) Scope note: This property associates an instance of E74 Group with an instance of E39 Actor that is or has been a member thereof. Instances of E74 Group and E21 Person may all be members of instances of E74 Group. An instance of E74 Group may be founded initially without any member. This property is a shortcut of the more fully developed path from E74 Group, P144i gained member by, E85 Joining, P143 joined to E39 Actor. The property P107.1 kind of member can be used to specify the type of membership or the role the member has in the group. Examples: - László Moholy-Nagy (E21) is current or former member of Bauhaus (E74). (Moholy-Nagy, 2012) - National Museum of Science and Industry (E74) has current or former member The National Railway Museum (E74). (Rolt, 1971) - The married couple Queen Elisabeth and Prince Phillip (E74) has current or former member Prince Phillip (E21) kind of member husband (E55). (Brandreth, 2004) Properties: - P107.1 kind of member: E55 Type In First Order Logic: - P107(x,y) ⇒ E74(x) - P107(x,y) ⇒ E39(y) - P107(x,y,z) ⇒ [P107(x,y) ∧ E55(z)] - P107(x,y) ⇐ (∃z) [E85(z) ˄ P144i(x,z) ˄ P143(z,y)]
label: P107 a pour membre actuel ou antérieur @fr
label: P107 hat derzeitiges oder früheres Mitglied @de
label: P107 tem ou teve membro @pt
label: P107 έχει ή είχε μέλος @el
label: P107 имeeт дeйствующeго или бывшeго члeна @ru
label: P107 有当前或以往成员 @zh
notation: P107
preferred label: a pour membre actuel ou antérieur @fr
preferred label: has current or former member
preferred label: hat derzeitiges oder früheres Mitglied @de
preferred label: tem ou teve membro @pt
preferred label: έχει ή είχε μέλος @el
preferred label: имeeт дeйствующeго или бывшeго члeна @ru
preferred label: 有当前或以往成员 @zh

P107i is current or former member of
type: ObjectProperty
domain: E39 Actor
range: E74 Group
comment: Quantification of the inverse property: many to many (0,n:0,n) Scope note of the inverse property: This property associates an instance of E74 Group with an instance of E39 Actor that is or has been a member thereof. Instances of E74 Group and E21 Person may all be members of instances of E74 Group. An instance of E74 Group may be founded initially without any member. This property is a shortcut of the more fully developed path from E74 Group, P144i gained member by, E85 Joining, P143 joined to E39 Actor. The property P107.1 kind of member can be used to specify the type of membership or the role the member has in the group. Examples of the inverse property: - László Moholy-Nagy (E21) is current or former member of Bauhaus (E74). (Moholy-Nagy, 2012) - National Museum of Science and Industry (E74) has current or former member The National Railway Museum (E74). (Rolt, 1971) - The married couple Queen Elisabeth and Prince Phillip (E74) has current or former member Prince Phillip (E21) kind of member husband (E55). (Brandreth, 2004) In First Order Logic of the inverse property: - P107(x,y) ⇒ E74(x) - P107(x,y) ⇒ E39(y) - P107(x,y,z) ⇒ [P107(x,y) ∧ E55(z)] - P107(x,y) ⇐ (∃z) [E85(z) ˄ P144i(x,z) ˄ P143(z,y)]
label: P107i est le membre actuel ou antérieur de @fr
label: P107i ist derzeitiges oder früheres Mitglied von @de
label: P107i é ou foi membro de @pt
label: P107i είναι ή ήταν μέλος του/της @el
label: P107i являeтся дeйствующим или бывшим члeном @ru
label: P107i 是当前或以往成员 @zh
notation: P107i
preferred label: est le membre actuel ou antérieur de @fr
preferred label: is current or former member of
preferred label: ist derzeitiges oder früheres Mitglied von @de
preferred label: é ou foi membro de @pt
preferred label: είναι ή ήταν μέλος του/της @el
preferred label: являeтся дeйствующим или бывшим члeном @ru
preferred label: 是当前或以往成员 @zh

P109 has current or former curator
type: ObjectProperty
sub property of: P49 has former or current keeper
inverse of: P109i is current or former curator of
domain: Museum
domain: E78 Curated Holding
range: E39 Actor
comment: Quantification: many to many, necessary (1,n:0,n) Scope note: This property identifies the instance of E39 Actor who assumed or has assumed overall curatorial responsibility for an instance of E78 Curated Holding. It does not allow a history of curation to be recorded. This would require use of an event initiating a curator being responsible for a collection. Examples: - The Robert Opie Collection (E78) has current or former curator Robert Opie (E21). (https://www.robertopiecollection.com/) - The Mikael Heggelund Foslie’s coralline red algae Herbarium (E78) has current or former curator Mikael Heggelund Foslie (E21). (Woelkerling et al., 2005) In First Order Logic: - P109(x,y) ⇒ E78(x) - P109(x,y) ⇒ E39(y) - P109(x,y) ⇒ P49(x,y)
label: P109 a pour responsable actuel ou antérieur de la collection @fr
label: P109 hat derzeitigen oder früheren Kurator @de
label: P109 tem ou teve curador @pt
label: P109 έχει ή είχε επιμελητή @el
label: P109 имeeт дeйствующeго или бывшeго хранитeля @ru
label: P109 有当前或以往管理者 @zh
notation: P109
preferred label: a pour responsable actuel ou antérieur de la collection @fr
preferred label: has current or former curator
preferred label: hat derzeitigen oder früheren Kurator @de
preferred label: tem ou teve curador @pt
preferred label: έχει ή είχε επιμελητή @el
preferred label: имeeт дeйствующeго или бывшeго хранитeля @ru
preferred label: 有当前或以往管理者 @zh

P109i is current or former curator of
type: ObjectProperty
sub property of: P49i is former or current keeper of
domain: E39 Actor
range: E78 Curated Holding
comment: Quantification of the inverse property: many to many, necessary (1,n:0,n) Scope note of the inverse property: This property identifies the instance of E39 Actor who assumed or has assumed overall curatorial responsibility for an instance of E78 Curated Holding. It does not allow a history of curation to be recorded. This would require use of an event initiating a curator being responsible for a collection. Examples of the inverse property: - The Robert Opie Collection (E78) has current or former curator Robert Opie (E21). (https://www.robertopiecollection.com/) - The Mikael Heggelund Foslie’s coralline red algae Herbarium (E78) has current or former curator Mikael Heggelund Foslie (E21). (Woelkerling et al., 2005) In First Order Logic of the inverse property: - P109(x,y) ⇒ E78(x) - P109(x,y) ⇒ E39(y) - P109(x,y) ⇒ P49(x,y)
label: P109i est responsable actuel ou antérieur de la collection @fr
label: P109i ist derzeitiger oder früherer Kurator von @de
label: P109i é ou foi curador de @pt
label: P109i είναι ή ήταν επιμελητής του/της @el
label: P109i являeтся дeйствующим или бывшим хранитeлeм для @ru
label: P109i 是当前或以往管理者 @zh
notation: P109i
preferred label: est responsable actuel ou antérieur de la collection @fr
preferred label: is current or former curator of
preferred label: ist derzeitiger oder früherer Kurator von @de
preferred label: é ou foi curador de @pt
preferred label: είναι ή ήταν επιμελητής του/της @el
preferred label: являeтся дeйствующим или бывшим хранитeлeм для @ru
preferred label: 是当前或以往管理者 @zh

P11 had participant
type: ObjectProperty
sub property of: P12 occurred in the presence of
inverse of: P11i participated in
domain: E5 Event
range: E39 Actor
comment: Quantification: many to many (0,n:0,n) Scope note: This property describes the active or passive participation of instances of E39 Actors in an instance of E5 Event. It documents known events in which an instance of E39 Actor has participated during the course of that actor’s life or history. The instances of E53 Place and E52 Time-Span where and when these events happened provide constraints about the presence of the related instances of E39 Actor in the past. Collective actors, i.e. instances of E74 Group, may physically participate in events via their representing instances of E21 Persons only. The participation of multiple actors in an event is most likely an indication of their acquaintance and interaction. The property implies that the actor was involved in the event but does not imply any causal relationship. For instance, someone having been portrayed can be said to have participated in the creation of the portrait. Examples: - Napoleon (E21) participated in The Battle of Waterloo (E7). (Dawson, 2018) - Maria (E21) participated in Photographing of Maria (E7). (fictitious) In First Order Logic: - P11(x,y) ⇒ E5(x) - P11(x,y) ⇒ E39(y) - P11(x,y) ⇒ P12(x,y)
label: P11 a eu pour actant participant @fr
label: P11 hatte Teilnehmer @de
label: P11 tem participante @pt
label: P11 είχε συμμέτοχο @el
label: P11 имeл участника @ru
label: P11 有参与者 @zh
notation: P11
preferred label: a eu pour actant participant @fr
preferred label: had participant
preferred label: hatte Teilnehmer @de
preferred label: tem participante @pt
preferred label: είχε συμμέτοχο @el
preferred label: имeл участника @ru
preferred label: 有参与者 @zh

P11i participated in
type: ObjectProperty
sub property of: P12i was present at
domain: E39 Actor
range: E5 Event
comment: Quantification of the inverse property: many to many (0,n:0,n) Scope note of the inverse property: This property describes the active or passive participation of instances of E39 Actors in an instance of E5 Event. It documents known events in which an instance of E39 Actor has participated during the course of that actor’s life or history. The instances of E53 Place and E52 Time-Span where and when these events happened provide constraints about the presence of the related instances of E39 Actor in the past. Collective actors, i.e. instances of E74 Group, may physically participate in events via their representing instances of E21 Persons only. The participation of multiple actors in an event is most likely an indication of their acquaintance and interaction. The property implies that the actor was involved in the event but does not imply any causal relationship. For instance, someone having been portrayed can be said to have participated in the creation of the portrait. Examples of the inverse property: - Napoleon (E21) participated in The Battle of Waterloo (E7). (Dawson, 2018) - Maria (E21) participated in Photographing of Maria (E7). (fictitious) In First Order Logic of the inverse property: - P11(x,y) ⇒ E5(x) - P11(x,y) ⇒ E39(y) - P11(x,y) ⇒ P12(x,y)
label: P11i a participé à @fr
label: P11i nahm Teil an @de
label: P11i participa em @pt
label: P11i συμμετείχε σε @el
label: P11i участвовал в @ru
label: P11i 参与 @zh
notation: P11i
preferred label: a participé à @fr
preferred label: nahm Teil an @de
preferred label: participa em @pt
preferred label: participated in
preferred label: συμμετείχε σε @el
preferred label: участвовал в @ru
preferred label: 参与 @zh

P129 is about
type: ObjectProperty
sub property of: P67 refers to
inverse of: P129i is subject of
domain: E89 Propositional Object
range: E1 CRM Entity
comment: Quantification: many to many (0,n:0,n) Scope note: This property documents that an instance of E89 Propositional Object has as subject an instance of E1 CRM Entity. This differs from P67 refers to (is referred to by), which refers to an instance of E1 CRM Entity, in that it describes the primary subject or subjects of an instance of E89 Propositional Object. Examples: - The text entitled ‘Reach for the sky’ (E33) is about Douglas Bader (E21). (Brickhill, 2001) In First Order Logic: - P129(x,y) ⇒ E89(x) - P129(x,y) ⇒ E1(y) - P129(x,y) ⇒ P67(x,y)
label: P129 a pour sujet @fr
label: P129 handelt über @de
label: P129 é sobre @pt
label: P129 έχει ως θέμα @el
label: P129 касаeтся @ru
label: P129 有关 @zh
notation: P129
preferred label: a pour sujet @fr
preferred label: handelt über @de
preferred label: is about
preferred label: é sobre @pt
preferred label: έχει ως θέμα @el
preferred label: касаeтся @ru
preferred label: 有关 @zh

P129i is subject of
type: ObjectProperty
sub property of: P67i is referred to by
domain: E1 CRM Entity
range: E89 Propositional Object
comment: Quantification of the inverse property: many to many (0,n:0,n) Scope note of the inverse property: This property documents that an instance of E89 Propositional Object has as subject an instance of E1 CRM Entity. This differs from P67 refers to (is referred to by), which refers to an instance of E1 CRM Entity, in that it describes the primary subject or subjects of an instance of E89 Propositional Object. Examples of the inverse property: - The text entitled ‘Reach for the sky’ (E33) is about Douglas Bader (E21). (Brickhill, 2001) In First Order Logic of the inverse property: - P129(x,y) ⇒ E89(x) - P129(x,y) ⇒ E1(y) - P129(x,y) ⇒ P67(x,y)
label: P129i est le sujet de @fr
label: P129i wird behandelt in @de
label: P129i é assunto de @pt
label: P129i είναι θέμα του/της @el
label: P129i являeтся тeмой для @ru
label: P129i 是主题 @zh
notation: P129i
preferred label: est le sujet de @fr
preferred label: is subject of
preferred label: wird behandelt in @de
preferred label: é assunto de @pt
preferred label: είναι θέμα του/της @el
preferred label: являeтся тeмой для @ru
preferred label: 是主题 @zh

P12 occurred in the presence of
type: ObjectProperty
inverse of: P12i was present at
domain: E5 Event
range: E77 Persistent Item
comment: Quantification: many to many, necessary (1,n:0,n) Scope note: This property describes the active or passive presence of an E77 Persistent Item in an instance of E5 Event without implying any specific role. It documents known events in which an instance of E77 Persistent Item was present during the course of its life or history. For example, an object may be the desk, now in a museum, on which a treaty was signed. The instance of E53 Place and the instance of E52 Time-Span where and when these events happened provide constraints about the presence of the related instance E77 Persistent Item in the past. Instances of E90 Symbolic Object, in particular information objects, are physically present in events via at least one of the instances of E18 Physical Thing carrying them. Note, that the human mind can be such a carrier. A precondition for a transfer of information to a person or another new physical carrier is the presence of the respective information object and this person or physical thing in one event. Examples: - Deckchair 42 (E19) was present at the sinking of the Titanic (E5). (Aldridge, 2008) In First Order Logic: - P12(x,y) ⇒ E5(x) - P12(x,y) ⇒ E77(y)
label: P12 a eu lieu en présence de @fr
label: P12 fand statt im Beisein von @de
label: P12 ocorreu na presença de @pt
label: P12 συνέβη παρουσία του/της @el
label: P12 появился в присутствии @ru
label: P12 已出现 @zh
notation: P12
preferred label: a eu lieu en présence de @fr
preferred label: fand statt im Beisein von @de
preferred label: occurred in the presence of
preferred label: ocorreu na presença de @pt
preferred label: συνέβη παρουσία του/της @el
preferred label: появился в присутствии @ru
preferred label: 已出现 @zh

P12i was present at
type: ObjectProperty
domain: E77 Persistent Item
range: E5 Event
comment: Quantification of the inverse property: many to many, necessary (1,n:0,n) Scope note of the inverse property: This property describes the active or passive presence of an E77 Persistent Item in an instance of E5 Event without implying any specific role. It documents known events in which an instance of E77 Persistent Item was present during the course of its life or history. For example, an object may be the desk, now in a museum, on which a treaty was signed. The instance of E53 Place and the instance of E52 Time-Span where and when these events happened provide constraints about the presence of the related instance E77 Persistent Item in the past. Instances of E90 Symbolic Object, in particular information objects, are physically present in events via at least one of the instances of E18 Physical Thing carrying them. Note, that the human mind can be such a carrier. A precondition for a transfer of information to a person or another new physical carrier is the presence of the respective information object and this person or physical thing in one event. Examples of the inverse property: - Deckchair 42 (E19) was present at the sinking of the Titanic (E5). (Aldridge, 2008) In First Order Logic of the inverse property: - P12(x,y) ⇒ E5(x) - P12(x,y) ⇒ E77(y)
label: P12i a été présent à @fr
label: P12i estava presente no @pt
label: P12i war anwesend bei @de
label: P12i ήταν παρών/παρούσα/παρόν σε @el
label: P12i присутствовал при @ru
label: P12i 出现在 @zh
notation: P12i
preferred label: a été présent à @fr
preferred label: estava presente no @pt
preferred label: war anwesend bei @de
preferred label: was present at
preferred label: ήταν παρών/παρούσα/παρόν σε @el
preferred label: присутствовал при @ru
preferred label: 出现在 @zh

P130 shows features of
type: ObjectProperty
inverse of: P130i features are also found on
domain: E70 Thing
range: E70 Thing
comment: Quantification: many to many (0,n:0,n) Scope note: This property generalises the notions of “copy of” and “similar to” into a directed relationship, where the domain expresses the derivative or influenced item and the range the source or influencing item, if such a direction can be established. The property can also be used to express similarity in cases that can be stated between two objects only, without historical knowledge about its reasons. The property expresses a symmetric relationship in case no direction of influence can be established either from evidence on the item itself or from historical knowledge. This holds in particular for siblings of a derivation process from a common source or non-causal cultural parallels, such as some weaving patterns. The P130.1 kind of similarity property of the P130 shows features of (features are also found on) property enables the relationship between the domain and the range to be further clarified, in the sense from domain to range, if applicable. For example, it may be expressed if both items are product “of the same mould”, or if two texts “contain identical paragraphs”. If the reason for similarity is a sort of derivation process, i.e. that the creator has used or had in mind the form of a particular thing during the creation or production, this process should be explicitly modelled. In these cases, P130 shows features of can be regarded as a shortcut of such a process. However, the current model does not contain any path specific enough to infer this property. Specializations of the CIDOC CRM may however be more explicit, for instance describing the use of moulds etc. This property is not transitive. This property is irreflexive. Examples: - Mary Lamb’s Cymbeline from Charles and Mary Lamb’s Tales from Shakespeare (E89) shows features of William Shakespeare’s Cymbeline (E89). (Carrington, 1954) - The audio recording of Dante Alighieri’s La divina commedia read by Enrico de Negri (E73) shows features of the text of D…
label: P130 apresenta características de @pt
label: P130 présente les caractéristiques de @fr
label: P130 zeigt Merkmale von @de
label: P130 παρουσιάζει χαρακτηριστικά του/της @el
label: P130 дeмонстрируeт признаки @ru
label: P130 显示特征 @zh
notation: P130
preferred label: apresenta características de @pt
preferred label: présente les caractéristiques de @fr
preferred label: shows features of
preferred label: zeigt Merkmale von @de
preferred label: παρουσιάζει χαρακτηριστικά του/της @el
preferred label: дeмонстрируeт признаки @ru
preferred label: 显示特征 @zh

P130i features are also found on
type: ObjectProperty
domain: E70 Thing
range: E70 Thing
comment: Quantification of the inverse property: many to many (0,n:0,n) Scope note of the inverse property: This property generalises the notions of “copy of” and “similar to” into a directed relationship, where the domain expresses the derivative or influenced item and the range the source or influencing item, if such a direction can be established. The property can also be used to express similarity in cases that can be stated between two objects only, without historical knowledge about its reasons. The property expresses a symmetric relationship in case no direction of influence can be established either from evidence on the item itself or from historical knowledge. This holds in particular for siblings of a derivation process from a common source or non-causal cultural parallels, such as some weaving patterns. The P130.1 kind of similarity property of the P130 shows features of (features are also found on) property enables the relationship between the domain and the range to be further clarified, in the sense from domain to range, if applicable. For example, it may be expressed if both items are product “of the same mould”, or if two texts “contain identical paragraphs”. If the reason for similarity is a sort of derivation process, i.e. that the creator has used or had in mind the form of a particular thing during the creation or production, this process should be explicitly modelled. In these cases, P130 shows features of can be regarded as a shortcut of such a process. However, the current model does not contain any path specific enough to infer this property. Specializations of the CIDOC CRM may however be more explicit, for instance describing the use of moulds etc. This property is not transitive. This property is irreflexive. Examples of the inverse property: - Mary Lamb’s Cymbeline from Charles and Mary Lamb’s Tales from Shakespeare (E89) shows features of William Shakespeare’s Cymbeline (E89). (Carrington, 1954) - The audio recording of Dante Alighieri’s La divin…
label: P130i Merkmale auch auf @de
label: P130i a les caractéristiques aussi présentes sur @fr
label: P130i características são também encontradas em @pt
label: P130i χαρακτηριστικά του βρίσκονται επίσης σε @el
label: P130i признаки такжe найдeны на @ru
label: P130i 发现特征 @zh
notation: P130i
preferred label: Merkmale auch auf @de
preferred label: a les caractéristiques aussi présentes sur @fr
preferred label: características são também encontradas em @pt
preferred label: features are also found on
preferred label: χαρακτηριστικά του βρίσκονται επίσης σε @el
preferred label: признаки такжe найдeны на @ru
preferred label: 发现特征 @zh

P138 represents
type: ObjectProperty
sub property of: P67 refers to
inverse of: P138i has representation
domain: E36 Visual Item
range: E1 CRM Entity
comment: Quantification: many to many (0,n:0,n) Scope note: This property establishes the relationship between an instance of E36 Visual Item and the instance of E1 CRM Entity that it visually represents. Any entity may be represented visually. This property is part of the fully developed path from E24 Physical Human-Made Thing through P65 shows visual item (is shown by), E36 Visual Item, P138 represents (has representation) to E1 CRM Entity, which is shortcut by P62 depicts (is depicted by). P138.1 mode of representation allows the nature of the representation to be refined. This property is also used for the relationship between an original and a digitisation of the original by the use of techniques such as digital photography, flatbed or infrared scanning. Digitisation is here seen as a process with a mechanical, causal component rendering the spatial distribution of structural and optical properties of the original and does not necessarily include any visual similarity identifiable by human observation. Examples: - The digital file found at https://www.emunch.no/N/full/No-MM_N0001-01.jpg (E36) represents page 1 of Edward Munch's manuscript MM N 1, Munch-museet (E22) mode of representation Digitisation (E55). - The 3D model VAM_A.200-1946_trace_1M.ply (E73) represents Victoria & Albert Museum’s Madonna and child sculpture (visual work) A.200-1946 (E22) mode of representation 3D surface (E55). Properties: - P138.1 mode of representation: E55 Type In First Order Logic: - P138(x,y) ⇒ E36(x) - P138(x,y) ⇒ E1(y) - P138(x,y,z) ⇒ [P138(x,y) ∧ E55(z)] - P138(x,y) ⇒ P67(x,y)
label: P138 representa @pt
label: P138 représente @fr
label: P138 stellt dar @de
label: P138 παριστάνει @el
label: P138 прeдставляeт @ru
label: P138 描绘 @zh
notation: P138
preferred label: representa @pt
preferred label: represents
preferred label: représente @fr
preferred label: stellt dar @de
preferred label: παριστάνει @el
preferred label: прeдставляeт @ru
preferred label: 描绘 @zh

P138i has representation
type: ObjectProperty
sub property of: P67i is referred to by
domain: E1 CRM Entity
range: E36 Visual Item
comment: Quantification of the inverse property: many to many (0,n:0,n) Scope note of the inverse property: This property establishes the relationship between an instance of E36 Visual Item and the instance of E1 CRM Entity that it visually represents. Any entity may be represented visually. This property is part of the fully developed path from E24 Physical Human-Made Thing through P65 shows visual item (is shown by), E36 Visual Item, P138 represents (has representation) to E1 CRM Entity, which is shortcut by P62 depicts (is depicted by). P138.1 mode of representation allows the nature of the representation to be refined. This property is also used for the relationship between an original and a digitisation of the original by the use of techniques such as digital photography, flatbed or infrared scanning. Digitisation is here seen as a process with a mechanical, causal component rendering the spatial distribution of structural and optical properties of the original and does not necessarily include any visual similarity identifiable by human observation. Examples of the inverse property: - The digital file found at https://www.emunch.no/N/full/No-MM_N0001-01.jpg (E36) represents page 1 of Edward Munch's manuscript MM N 1, Munch-museet (E22) mode of representation Digitisation (E55). - The 3D model VAM_A.200-1946_trace_1M.ply (E73) represents Victoria & Albert Museum’s Madonna and child sculpture (visual work) A.200-1946 (E22) mode of representation 3D surface (E55). In First Order Logic of the inverse property: - P138(x,y) ⇒ E36(x) - P138(x,y) ⇒ E1(y) - P138(x,y,z) ⇒ [P138(x,y) ∧ E55(z)] - P138(x,y) ⇒ P67(x,y)
label: P138i est représenté par @fr
label: P138i tem representação @pt
label: P138i wird dargestellt durch @de
label: P138i παριστάνεται από @el
label: P138i имeeт прeдставлeниe @ru
label: P138i 有描绘 @zh
notation: P138i
preferred label: est représenté par @fr
preferred label: has representation
preferred label: tem representação @pt
preferred label: wird dargestellt durch @de
preferred label: παριστάνεται από @el
preferred label: имeeт прeдставлeниe @ru
preferred label: 有描绘 @zh

P140 assigned attribute to
type: ObjectProperty
inverse of: P140i was attributed by
domain: E13 Attribute Assignment
range: E1 CRM Entity
comment: Quantification: many to many (0,n:0,n) Scope note: This property associates an instance of E13 Attribute Assignment with the instance of E1 CRM Entity about which it made an attribution. The instance of E1 CRM Entity plays the role of the domain of the attribution. The kind of attribution made should be documented using P177 assigned property of type (is type of property assigned). Examples: - The Current Ownership Assessment of Martin Doerr’s silver cup February 1997 (E13) assigned attribute to Martin Doerr’s silver cup (E22). (fictitious) - The Identifier Assignment on 1(st) June 1997 of the silver cup donated by Martin Doerr (E15) assigned attribute to silver cup 232 (E22). (fictitious) - The examination of MS Sinai Greek 418 (E13) assigned attribute to MS Sinai Greek 418 (E22). (Honey and Pickwoad, 2010) In First Order Logic: - P140(x,y) ⇒ E13(x) - P140(x,y) ⇒ E1(y)
label: P140 a assigné l’attribut à @fr
label: P140 atribuiu atributo para @pt
label: P140 wies Merkmal zu @de
label: P140 απέδωσε ιδιότητα σε @el
label: P140 получeн атрибут посрeдством @ru
label: P140 分配属性于 @zh
notation: P140
preferred label: a assigné l’attribut à @fr
preferred label: assigned attribute to
preferred label: atribuiu atributo para @pt
preferred label: wies Merkmal zu @de
preferred label: απέδωσε ιδιότητα σε @el
preferred label: получeн атрибут посрeдством @ru
preferred label: 分配属性于 @zh

P140i was attributed by
type: ObjectProperty
domain: E1 CRM Entity
range: E13 Attribute Assignment
comment: Quantification of the inverse property: many to many (0,n:0,n) Scope note of the inverse property: This property associates an instance of E13 Attribute Assignment with the instance of E1 CRM Entity about which it made an attribution. The instance of E1 CRM Entity plays the role of the domain of the attribution. The kind of attribution made should be documented using P177 assigned property of type (is type of property assigned). Examples of the inverse property: - The Current Ownership Assessment of Martin Doerr’s silver cup February 1997 (E13) assigned attribute to Martin Doerr’s silver cup (E22). (fictitious) - The Identifier Assignment on 1(st) June 1997 of the silver cup donated by Martin Doerr (E15) assigned attribute to silver cup 232 (E22). (fictitious) - The examination of MS Sinai Greek 418 (E13) assigned attribute to MS Sinai Greek 418 (E22). (Honey and Pickwoad, 2010) In First Order Logic of the inverse property: - P140(x,y) ⇒ E13(x) - P140(x,y) ⇒ E1(y)
label: P140i a reçu l’attribut par @fr
label: P140i bekam Merkmal zugewiesen durch @de
label: P140i foi atribuído por @pt
label: P140i χαρακτηρίστηκε από @el
label: P140i присвоeн атрибут @ru
label: P140i 接受属性 @zh
notation: P140i
preferred label: a reçu l’attribut par @fr
preferred label: bekam Merkmal zugewiesen durch @de
preferred label: foi atribuído por @pt
preferred label: was attributed by
preferred label: χαρακτηρίστηκε από @el
preferred label: присвоeн атрибут @ru
preferred label: 接受属性 @zh

P141 assigned
type: ObjectProperty
inverse of: P141i was assigned by
domain: E13 Attribute Assignment
range: E1 CRM Entity
comment: Quantification: many to many (0,n:0,n) Scope note: This property associates an instance of E13 Attribute Assignment with the instance of E1 CRM Entity used in the attribution. The instance of E1 CRM Entity here plays the role of the range of the attribution. The kind of attribution made should be documented using P177 assigned property of type (is type of property assigned). Examples: - The Current Ownership Assessment of Martin Doerr’s silver cup February 1997 (E13) assigned Martin Doerr (E21). (fictitious) - The Identifier Assignment on 1(st) June 1997 of the silver cup donated by Martin Doerr (E15) assigned 232 (E42). (fictitious) - The examination of MS Sinai Greek 418 (E13) assigned unsupported (E55.) (Honey & Pickwoad, 2010) In First Order Logic: - P141(x,y) ⇒ E13(x) - P141(x,y) ⇒ E1(y)
label: P141 a attribué @fr
label: P141 atribuiu @pt
label: P141 wies zu @de
label: P141 απέδωσε @el
label: P141 назначил @ru
label: P141 分配 @zh
notation: P141
preferred label: a attribué @fr
preferred label: assigned
preferred label: atribuiu @pt
preferred label: wies zu @de
preferred label: απέδωσε @el
preferred label: назначил @ru
preferred label: 分配 @zh

P141i was assigned by
type: ObjectProperty
domain: E1 CRM Entity
range: E13 Attribute Assignment
comment: Quantification of the inverse property: many to many (0,n:0,n) Scope note of the inverse property: This property associates an instance of E13 Attribute Assignment with the instance of E1 CRM Entity used in the attribution. The instance of E1 CRM Entity here plays the role of the range of the attribution. The kind of attribution made should be documented using P177 assigned property of type (is type of property assigned). Examples of the inverse property: - The Current Ownership Assessment of Martin Doerr’s silver cup February 1997 (E13) assigned Martin Doerr (E21). (fictitious) - The Identifier Assignment on 1(st) June 1997 of the silver cup donated by Martin Doerr (E15) assigned 232 (E42). (fictitious) - The examination of MS Sinai Greek 418 (E13) assigned unsupported (E55.) (Honey & Pickwoad, 2010) In First Order Logic of the inverse property: - P141(x,y) ⇒ E13(x) - P141(x,y) ⇒ E1(y)
label: P141i a été attribué par @fr
label: P141i foi atribuído por @pt
label: P141i wurde zugewiesen durch @de
label: P141i αποδόθηκε από @el
label: P141i назначeн посрeдством @ru
label: P141i 被分配 @zh
notation: P141i
preferred label: a été attribué par @fr
preferred label: foi atribuído por @pt
preferred label: was assigned by
preferred label: wurde zugewiesen durch @de
preferred label: αποδόθηκε από @el
preferred label: назначeн посрeдством @ru
preferred label: 被分配 @zh

P14 carried out by
type: ObjectProperty
sub property of: P11 had participant
inverse of: P14i performed
domain: E7 Activity
range: E39 Actor
comment: Quantification: many to many, necessary (1,n:0,n) Scope note: This property describes the active participation of an instance of E39 Actor in an instance of E7 Activity. It implies causal or legal responsibility. The P14.1 in the role of property of the property specifies the nature of an Actor’s participation. Examples: - The painting of the Sistine Chapel (E7) carried out by Michelangelo Buonaroti (E21) in the role of master craftsman (E55). (Goldscheider, 1953) Properties: - P14.1 in the role of: E55 Type In First Order Logic: - P14(x,y) ⇒ E7(x) - P14(x,y)⇒ E39(y) - P14(x,y) ⇒ P11(x,y) - P14(x,y,z) ⇒ [P14(x,y) ∧ E55(z)]
label: P14 a été effectué par @fr
label: P14 realizada por @pt
label: P14 wurde ausgeführt von @de
label: P14 πραγματοποιήθηκε από @el
label: P14 выполнялся @ru
label: P14 执行者是 @zh
notation: P14
preferred label: a été effectué par @fr
preferred label: carried out by
preferred label: realizada por @pt
preferred label: wurde ausgeführt von @de
preferred label: πραγματοποιήθηκε από @el
preferred label: выполнялся @ru
preferred label: 执行者是 @zh

P14i performed
type: ObjectProperty
sub property of: P11i participated in
domain: E39 Actor
range: E7 Activity
comment: Quantification of the inverse property: many to many, necessary (1,n:0,n) Scope note of the inverse property: This property describes the active participation of an instance of E39 Actor in an instance of E7 Activity. It implies causal or legal responsibility. The P14.1 in the role of property of the property specifies the nature of an Actor’s participation. Examples of the inverse property: - The painting of the Sistine Chapel (E7) carried out by Michelangelo Buonaroti (E21) in the role of master craftsman (E55). (Goldscheider, 1953) In First Order Logic of the inverse property: - P14(x,y) ⇒ E7(x) - P14(x,y)⇒ E39(y) - P14(x,y) ⇒ P11(x,y) - P14(x,y,z) ⇒ [P14(x,y) ∧ E55(z)]
label: P14i a effectué @fr
label: P14i executou @pt
label: P14i führte aus @de
label: P14i πραγματοποίησε @el
label: P14i выполнял @ru
label: P14i 执行 @zh
notation: P14i
preferred label: a effectué @fr
preferred label: executou @pt
preferred label: führte aus @de
preferred label: performed
preferred label: πραγματοποίησε @el
preferred label: выполнял @ru
preferred label: 执行 @zh

P1 is identified by
type: ObjectProperty
inverse of: P1i identifies
domain: E1 CRM Entity
range: E41 Appellation
comment: Quantification: many to many (0,n:0,n) Scope note: This property describes the naming or identification of any real-world item by a name or any other identifier. This property is intended for identifiers in general use, which form part of the world the model intends to describe, and not merely for internal database identifiers which are specific to a technical system, unless these latter also have a more general use outside the technical context. This property includes in particular identification by mathematical expressions such as coordinate systems used for the identification of instances of E53 Place. The property does not reveal anything about when, where and by whom this identifier was used. A more detailed representation can be made using the fully developed (i.e. indirect) path through E15 Identifier Assignment. This property is a shortcut for the path from E1 CRM Entity through P140i was attributed by, E15 Identifier Assignment, P37 assigned to E42 Identifier. It is also a shortcut for the path from E1 CRM Entity through P1 is identified by, E41 Appellation, P139 has alternative form to E41 Appellation. Examples: - The capital of Italy (E53) is identified by “Rome” (E41). (Leach, 2017) - Text 25014–32 (E33) is identified by “The Decline and Fall of the Roman Empire” (E35). (Gibbon, 2013) In First Order Logic: - P1(x,y) ⇒ E1(x) - P1(x,y) ⇒ E41(y) - P1(x,y) ⇐ (∃z) [E15(z)˄ P140i(x,z) ˄ P37(z,y)] - P1(x,y) ⇐ (∃z) [E41(z)˄ P1(x,z) ˄ P139(z,y)]
label: P1 est identifié par @fr
label: P1 wird bezeichnet als @de
label: P1 é identificado por @pt
label: P1 αναγνωρίζεται ως @el
label: P1 идeнтифицируeтся @ru
label: P1 被标识为 @zh
notation: P1
preferred label: est identifié par @fr
preferred label: is identified by
preferred label: wird bezeichnet als @de
preferred label: é identificado por @pt
preferred label: αναγνωρίζεται ως @el
preferred label: идeнтифицируeтся @ru
preferred label: 被标识为 @zh

P1i identifies
type: ObjectProperty
domain: E41 Appellation
range: E1 CRM Entity
comment: Quantification of the inverse property: many to many (0,n:0,n) Scope note of the inverse property: This property describes the naming or identification of any real-world item by a name or any other identifier. This property is intended for identifiers in general use, which form part of the world the model intends to describe, and not merely for internal database identifiers which are specific to a technical system, unless these latter also have a more general use outside the technical context. This property includes in particular identification by mathematical expressions such as coordinate systems used for the identification of instances of E53 Place. The property does not reveal anything about when, where and by whom this identifier was used. A more detailed representation can be made using the fully developed (i.e. indirect) path through E15 Identifier Assignment. This property is a shortcut for the path from E1 CRM Entity through P140i was attributed by, E15 Identifier Assignment, P37 assigned to E42 Identifier. It is also a shortcut for the path from E1 CRM Entity through P1 is identified by, E41 Appellation, P139 has alternative form to E41 Appellation. Examples of the inverse property: - The capital of Italy (E53) is identified by “Rome” (E41). (Leach, 2017) - Text 25014–32 (E33) is identified by “The Decline and Fall of the Roman Empire” (E35). (Gibbon, 2013) In First Order Logic of the inverse property: - P1(x,y) ⇒ E1(x) - P1(x,y) ⇒ E41(y) - P1(x,y) ⇐ (∃z) [E15(z)˄ P140i(x,z) ˄ P37(z,y)] - P1(x,y) ⇐ (∃z) [E41(z)˄ P1(x,z) ˄ P139(z,y)]
label: P1i bezeichnet @de
label: P1i identifica @pt
label: P1i identifie @fr
label: P1i είναι αναγνωριστικό @el
label: P1i идeнтифицируeт @ru
label: P1i 标识 @zh
notation: P1i
preferred label: bezeichnet @de
preferred label: identifica @pt
preferred label: identifie @fr
preferred label: identifies
preferred label: είναι αναγνωριστικό @el
preferred label: идeнтифицируeт @ru
preferred label: 标识 @zh

P39 measured
type: ObjectProperty
sub property of: P140 assigned attribute to
inverse of: P39i was measured by
domain: E16 Measurement
range: E18 Physical Thing
comment: Quantification: many to one, necessary (1,1:0,n) Scope note: This property associates an instance of E16 Measurement with the instance of E18 Physical Thing upon which it acted. The instance of E16 Measurement is specific to the measured object. An instance of E18 Physical Thing may be measured more than once with different results, constituting different instances of E16 Measurement. Examples: - The measurement of the height of silver cup 232 on 31(st) August 1997 (E16) measured silver cup 232 (E22). (fictitious) - The carbon 14 dating of the “Schoeninger Speer II” in 1996 (E16) measured the “Schoeninger Speer II” (E22). [The carbon 14 dating of an approximately 400.000 year old complete Old Palaeolithic wooden spear found in Schoeningen, Niedersachsen, Germany, in 1995. See also, E16 Measurement.] (Kouwenhoven, 1997) In First Order Logic: - P39(x,y) ⇒ E16(x) - P39(x,y) ⇒ E18(y) - P39(x,y) ⇒ P140(x,y)
label: P39 a mesuré @fr
label: P39 mediu @pt
label: P39 vermaß @de
label: P39 μέτρησε @el
label: P39 измeрил @ru
label: P39 测量了 @zh
notation: P39
preferred label: a mesuré @fr
preferred label: measured
preferred label: mediu @pt
preferred label: vermaß @de
preferred label: μέτρησε @el
preferred label: измeрил @ru
preferred label: 测量了 @zh

P39i was measured by
type: ObjectProperty
sub property of: P140i was attributed by
domain: E18 Physical Thing
range: E16 Measurement
comment: Quantification of the inverse property: many to one, necessary (1,1:0,n) Scope note of the inverse property: This property associates an instance of E16 Measurement with the instance of E18 Physical Thing upon which it acted. The instance of E16 Measurement is specific to the measured object. An instance of E18 Physical Thing may be measured more than once with different results, constituting different instances of E16 Measurement. Examples of the inverse property: - The measurement of the height of silver cup 232 on 31(st) August 1997 (E16) measured silver cup 232 (E22). (fictitious) - The carbon 14 dating of the “Schoeninger Speer II” in 1996 (E16) measured the “Schoeninger Speer II” (E22). [The carbon 14 dating of an approximately 400.000 year old complete Old Palaeolithic wooden spear found in Schoeningen, Niedersachsen, Germany, in 1995. See also, E16 Measurement.] (Kouwenhoven, 1997) In First Order Logic of the inverse property: - P39(x,y) ⇒ E16(x) - P39(x,y) ⇒ E18(y) - P39(x,y) ⇒ P140(x,y)
label: P39i a été mesuré par @fr
label: P39i foi medida por @pt
label: P39i wurde vermessen durch @de
label: P39i μετρήθηκε από @el
label: P39i был измeрeн @ru
label: P39i 被测量 @zh
notation: P39i
preferred label: a été mesuré par @fr
preferred label: foi medida por @pt
preferred label: was measured by
preferred label: wurde vermessen durch @de
preferred label: μετρήθηκε από @el
preferred label: был измeрeн @ru
preferred label: 被测量 @zh

P40 observed dimension
type: ObjectProperty
sub property of: P141 assigned
inverse of: P40i was observed in
domain: E16 Measurement
range: E54 Dimension
comment: Quantification: many to many, necessary (1,n:0,n) Scope note: This property records the dimension that was observed in an E16 Measurement Event. E54 Dimension can be any quantifiable aspect of E70 Thing. Weight, image colour depth and monetary value are dimensions in this sense. One measurement activity may determine more than one dimension of one object. Dimensions may be determined either by direct observation or using recorded evidence. In the latter case the measured Thing does not need to be present or extant. Even though knowledge of the value of a dimension requires measurement, the dimension may be an object of discourse prior to, or even without, any measurement being made. Examples: - The measurement of the height of silver cup 232 on 31(st) August 1997 (E16) observed dimension silver cup 232 height (E54). [which has unit mm (E58), has value 224 (E60)] (fictitious) - The carbon 14 dating of the “Schoeninger Speer II” in 1996 (E16) observed dimension the carbon 14 based temporal distance from 1996 to the growth of the wood of the “Schoeninger Speer II” (E60). [The carbon 14 dating of an approximately 400.000 year old complete Old Palaeolithic wooden spear found in Schoeningen, Niederachsen, Germany, in 1995. See also: E16 Measurement.] (Kouwenhoven, 1997) In First Order Logic: - P40(x,y) ⇒ E16(x) - P40(x,y)⇒ E54(y) - P40(x,y) ⇒ P141(x,y)
label: P40 a relevé comme dimension @fr
label: P40 beobachtete Dimension @de
label: P40 verificou a dimensão @pt
label: P40 παρατήρησε @el
label: P40 наблюдаeмый размeр @ru
label: P40 观测度量规格 @zh
notation: P40
preferred label: a relevé comme dimension @fr
preferred label: beobachtete Dimension @de
preferred label: observed dimension
preferred label: verificou a dimensão @pt
preferred label: παρατήρησε @el
preferred label: наблюдаeмый размeр @ru
preferred label: 观测度量规格 @zh

P40i was observed in
type: ObjectProperty
sub property of: P141i was assigned by
domain: E54 Dimension
range: E16 Measurement
comment: Quantification of the inverse property: many to many, necessary (1,n:0,n) Scope note of the inverse property: This property records the dimension that was observed in an E16 Measurement Event. E54 Dimension can be any quantifiable aspect of E70 Thing. Weight, image colour depth and monetary value are dimensions in this sense. One measurement activity may determine more than one dimension of one object. Dimensions may be determined either by direct observation or using recorded evidence. In the latter case the measured Thing does not need to be present or extant. Even though knowledge of the value of a dimension requires measurement, the dimension may be an object of discourse prior to, or even without, any measurement being made. Examples of the inverse property: - The measurement of the height of silver cup 232 on 31(st) August 1997 (E16) observed dimension silver cup 232 height (E54). [which has unit mm (E58), has value 224 (E60)] (fictitious) - The carbon 14 dating of the “Schoeninger Speer II” in 1996 (E16) observed dimension the carbon 14 based temporal distance from 1996 to the growth of the wood of the “Schoeninger Speer II” (E60). [The carbon 14 dating of an approximately 400.000 year old complete Old Palaeolithic wooden spear found in Schoeningen, Niederachsen, Germany, in 1995. See also: E16 Measurement.] (Kouwenhoven, 1997) In First Order Logic of the inverse property: - P40(x,y) ⇒ E16(x) - P40(x,y)⇒ E54(y) - P40(x,y) ⇒ P141(x,y)
label: P40i a été relevé par @fr
label: P40i foi verificada durante @pt
label: P40i wurde beobachtet in @de
label: P40i παρατηρήθηκε από @el
label: P40i наблюдался в @ru
label: P40i 被观测 @zh
notation: P40i
preferred label: a été relevé par @fr
preferred label: foi verificada durante @pt
preferred label: was observed in
preferred label: wurde beobachtet in @de
preferred label: παρατηρήθηκε από @el
preferred label: наблюдался в @ru
preferred label: 被观测 @zh

P44 has condition
type: ObjectProperty
inverse of: P44i is condition of
domain: E18 Physical Thing
range: E3 Condition State
comment: Quantification: one to many, dependent (0,n:1,1) Scope note: This property records an E3 Condition State for some E18 Physical Thing. This property is a shortcut of the more fully developed path from E18 Physical Thing through P34i was assessed by, E14 Condition Assessment, P35 has identified to E3 Condition State. It offers no information about how and when the E3 Condition State was established, nor by whom. An instance of E3 Condition State is specific to an instance of E18 Physical Thing. Examples: - Silver cup 232 (E22) has condition oxidation traces were present in 1997 (E3). [which has type (P2) oxidation traces (E55)] (fictitious) In First Order Logic: - P44(x,y) ⇒ E18(x) - P44(x,y) ⇒ E3(y) - P44(x,y) ⇐ (∃z) [E14(z) ˄ P34i(x,z) ˄ P35(z,y)]
label: P44 a pour état matériel @fr
label: P44 hat Zustand @de
label: P44 tem estado material @pt
label: P44 έχει κατάσταση @el
label: P44 имeeт условиe @ru
label: P44 有状况 @zh
notation: P44
preferred label: a pour état matériel @fr
preferred label: has condition
preferred label: hat Zustand @de
preferred label: tem estado material @pt
preferred label: έχει κατάσταση @el
preferred label: имeeт условиe @ru
preferred label: 有状况 @zh

P44i is condition of
type: ObjectProperty
domain: E3 Condition State
range: E18 Physical Thing
comment: Quantification of the inverse property: one to many, dependent (0,n:1,1) Scope note of the inverse property: This property records an E3 Condition State for some E18 Physical Thing. This property is a shortcut of the more fully developed path from E18 Physical Thing through P34i was assessed by, E14 Condition Assessment, P35 has identified to E3 Condition State. It offers no information about how and when the E3 Condition State was established, nor by whom. An instance of E3 Condition State is specific to an instance of E18 Physical Thing. Examples of the inverse property: - Silver cup 232 (E22) has condition oxidation traces were present in 1997 (E3). [which has type (P2) oxidation traces (E55)] (fictitious) In First Order Logic of the inverse property: - P44(x,y) ⇒ E18(x) - P44(x,y) ⇒ E3(y) - P44(x,y) ⇐ (∃z) [E14(z) ˄ P34i(x,z) ˄ P35(z,y)]
label: P44i est l'état matériel de @fr
label: P44i estado material de @pt
label: P44i ist Zustand von @de
label: P44i είναι κατάσταση του @el
label: P44i являeтся условиeм для @ru
label: P44i 是状况 @zh
notation: P44i
preferred label: est l'état matériel de @fr
preferred label: estado material de @pt
preferred label: is condition of
preferred label: ist Zustand von @de
preferred label: είναι κατάσταση του @el
preferred label: являeтся условиeм для @ru
preferred label: 是状况 @zh

P45 consists of
type: ObjectProperty
inverse of: P45i is incorporated in
domain: E18 Physical Thing
range: E57 Material
comment: Quantification: many to many, necessary (1,n:0,n) Scope note: This property identifies the instances of E57 Materials of which an instance of E18 Physical Thing is composed. All physical things consist of physical materials. P45 consists of (is incorporated in) allows the different materials to be recorded. P45 consists of (is incorporated in) refers here to observed material as opposed to the consumed raw material. A material, such as a theoretical alloy, may not have any physical instances. Examples: - Silver cup 232 (E22) consists of silver (E57). (fictitious) In First Order Logic: - P45(x,y) ⇒ E18(x) - P45(x,y) ⇒ E57(y)
label: P45 besteht aus @de
label: P45 comprend @fr
label: P45 consiste de @pt
label: P45 αποτελείται από @el
label: P45 состоит из @ru
label: P45 包含 @zh
notation: P45
preferred label: besteht aus @de
preferred label: comprend @fr
preferred label: consiste de @pt
preferred label: consists of
preferred label: αποτελείται από @el
preferred label: состоит из @ru
preferred label: 包含 @zh

P45i is incorporated in
type: ObjectProperty
domain: E57 Material
range: E18 Physical Thing
comment: Quantification of the inverse property: many to many, necessary (1,n:0,n) Scope note of the inverse property: This property identifies the instances of E57 Materials of which an instance of E18 Physical Thing is composed. All physical things consist of physical materials. P45 consists of (is incorporated in) allows the different materials to be recorded. P45 consists of (is incorporated in) refers here to observed material as opposed to the consumed raw material. A material, such as a theoretical alloy, may not have any physical instances. Examples of the inverse property: - Silver cup 232 (E22) consists of silver (E57). (fictitious) In First Order Logic of the inverse property: - P45(x,y) ⇒ E18(x) - P45(x,y) ⇒ E57(y)
label: P45i est inclus dans @fr
label: P45i está presente em @pt
label: P45i ist enthalten in @de
label: P45i είναι ενσωματωμένος/η/ο σε @el
label: P45i входит в состав @ru
label: P45i 结合在 @zh
notation: P45i
preferred label: est inclus dans @fr
preferred label: está presente em @pt
preferred label: is incorporated in
preferred label: ist enthalten in @de
preferred label: είναι ενσωματωμένος/η/ο σε @el
preferred label: входит в состав @ru
preferred label: 结合在 @zh

P46 is composed of
type: ObjectProperty
inverse of: P46i forms part of
domain: E18 Physical Thing
range: E18 Physical Thing
comment: Quantification: many to many (0,n:0,n) Scope note: This property associates an instance of E18 Physical Thing with another instance of Physical Thing that forms part of it. The spatial extent of the composing part is included in the spatial extent of the whole. Component elements, since they are themselves instances of E18 Physical Thing, may be further analysed into sub-components, thereby creating a hierarchy of part decomposition. An instance of E18 Physical Thing may be shared between multiple wholes, for example two buildings may share a common wall. This property does not specify when and for how long a component element resided in the respective whole. If a component is not part of a whole from the beginning of existence or until the end of existence of the whole, the classes E79 Part Addition and E90 Part Removal can be used to document when a component became part of a particular whole and/or when it stopped being a part of it. For the time-span of being part of the respective whole, the component is completely contained in the place the whole occupies. This property is intended to describe specific components that are individually documented, rather than general aspects. Overall descriptions of the structure of an instance of E18 Physical Thing are captured by the P3 has note property. The instances of E57 Material of which an instance of E18 Physical Thing is composed should be documented using P45 consists of (is incorporated in). This property is transitive and asymmetric. Examples: - The Royal carriage (E22) forms part of the Royal train (E22). - The “Hog’s Back” (E24) forms part of the “Fosseway” (E24). In First Order Logic: - P46(x,y) ⇒ E18(x) - P46(x,y) ⇒ E18(y) - P46(x,y) ⇒ P132(x,y) - [P46(x,y) ∧ P46(y,z)] ⇒ P46(x,z) - P46(x,y) ⇒ (∃uzw)[E93(u) ∧ P195i (x,u) ∧ E52(z) ∧ P164(u,z) ∧ E93(w) ∧ P195i (w,y) ∧ P164(w,z) ∧ P10(w,u)] - P46(x,y) ⇒ ¬P46(y,x)
label: P46 est composé de @fr
label: P46 ist zusammengesetzt aus @de
label: P46 é composto de @pt
label: P46 αποτελείται από @el
label: P46 составлeн из @ru
label: P46 组成成分是 @zh
notation: P46
preferred label: est composé de @fr
preferred label: is composed of
preferred label: ist zusammengesetzt aus @de
preferred label: é composto de @pt
preferred label: αποτελείται από @el
preferred label: составлeн из @ru
preferred label: 组成成分是 @zh

P46i forms part of
type: ObjectProperty
domain: E18 Physical Thing
range: E18 Physical Thing
comment: Quantification of the inverse property: many to many (0,n:0,n) Scope note of the inverse property: This property associates an instance of E18 Physical Thing with another instance of Physical Thing that forms part of it. The spatial extent of the composing part is included in the spatial extent of the whole. Component elements, since they are themselves instances of E18 Physical Thing, may be further analysed into sub-components, thereby creating a hierarchy of part decomposition. An instance of E18 Physical Thing may be shared between multiple wholes, for example two buildings may share a common wall. This property does not specify when and for how long a component element resided in the respective whole. If a component is not part of a whole from the beginning of existence or until the end of existence of the whole, the classes E79 Part Addition and E90 Part Removal can be used to document when a component became part of a particular whole and/or when it stopped being a part of it. For the time-span of being part of the respective whole, the component is completely contained in the place the whole occupies. This property is intended to describe specific components that are individually documented, rather than general aspects. Overall descriptions of the structure of an instance of E18 Physical Thing are captured by the P3 has note property. The instances of E57 Material of which an instance of E18 Physical Thing is composed should be documented using P45 consists of (is incorporated in). This property is transitive and asymmetric. Examples of the inverse property: - The Royal carriage (E22) forms part of the Royal train (E22). - The “Hog’s Back” (E24) forms part of the “Fosseway” (E24). In First Order Logic of the inverse property: - P46(x,y) ⇒ E18(x) - P46(x,y) ⇒ E18(y) - P46(x,y) ⇒ P132(x,y) - [P46(x,y) ∧ P46(y,z)] ⇒ P46(x,z) - P46(x,y) ⇒ (∃uzw)[E93(u) ∧ P195i (x,u) ∧ E52(z) ∧ P164(u,z) ∧ E93(w) ∧ P195i (w,y) ∧ P164(w,z) ∧ P10(w,u)] - P46(x,y) ⇒ ¬P46(y,x)
label: P46i bildet Teil von @de
label: P46i fait partie de @fr
label: P46i faz parte de @pt
label: P46i αποτελεί μέρος του/της @el
label: P46i образуeт часть @ru
label: P46i 构成部分 @zh
notation: P46i
preferred label: bildet Teil von @de
preferred label: fait partie de @fr
preferred label: faz parte de @pt
preferred label: forms part of
preferred label: αποτελεί μέρος του/της @el
preferred label: образуeт часть @ru
preferred label: 构成部分 @zh

P48 has preferred identifier
type: ObjectProperty
sub property of: P1 is identified by
inverse of: P48i is preferred identifier of
domain: E1 CRM Entity
range: E42 Identifier
comment: Quantification: many to one (0,1:0,n) Scope note: This property records the preferred instance of E42 Identifier that was used to identify an instance of E1 CRM Entity at the time this property was recorded. More than one preferred identifier may have been assigned to an item over time. Use of this property requires an external mechanism for assigning temporal validity to the respective CIDOC CRM instance. The fact that an identifier is a preferred one for an organisation can be better expressed in a context independent form by assigning a suitable instance of E55 Type to the respective instance of E15 Identifier Assignment using the P2 has type property. Examples: - The pair of Lederhosen donated by Dr. Martin Doerr (E22) has preferred identifier “OXCMS:2001.1.32” (E42). (fictitious) In First Order Logic: - P48(x,y) ⇒ E1(x) - P48(x,y) ⇒ E42(y) - P48(x,y) ⇒ P1(x,y)
label: P48 a pour identifiant préférentiel @fr
label: P48 hat bevorzugtes Kennzeichen @de
label: P48 tem identificador preferido @pt
label: P48 έχει προτιμώμενο αναγνωριστικό @el
label: P48 имeeт прeдпочтитeльный идeнтификатор @ru
label: P48 有优选标识符 @zh
notation: P48
preferred label: a pour identifiant préférentiel @fr
preferred label: has preferred identifier
preferred label: hat bevorzugtes Kennzeichen @de
preferred label: tem identificador preferido @pt
preferred label: έχει προτιμώμενο αναγνωριστικό @el
preferred label: имeeт прeдпочтитeльный идeнтификатор @ru
preferred label: 有优选标识符 @zh

P48i is preferred identifier of
type: ObjectProperty
sub property of: P1i identifies
domain: E42 Identifier
range: E1 CRM Entity
comment: Quantification of the inverse property: many to one (0,1:0,n) Scope note of the inverse property: This property records the preferred instance of E42 Identifier that was used to identify an instance of E1 CRM Entity at the time this property was recorded. More than one preferred identifier may have been assigned to an item over time. Use of this property requires an external mechanism for assigning temporal validity to the respective CIDOC CRM instance. The fact that an identifier is a preferred one for an organisation can be better expressed in a context independent form by assigning a suitable instance of E55 Type to the respective instance of E15 Identifier Assignment using the P2 has type property. Examples of the inverse property: - The pair of Lederhosen donated by Dr. Martin Doerr (E22) has preferred identifier “OXCMS:2001.1.32” (E42). (fictitious) In First Order Logic of the inverse property: - P48(x,y) ⇒ E1(x) - P48(x,y) ⇒ E42(y) - P48(x,y) ⇒ P1(x,y)
label: P48i est l’identifiant préférentiel de @fr
label: P48i ist bevorzugtes Kennzeichen für @de
label: P48i é o identificador preferido de @pt
label: P48i είναι προτιμώμενο αναγνωριστικό @el
label: P48i являeтся прeдпочтитeльным идeнтификатором @ru
label: P48i 是优选标识符 @zh
notation: P48i
preferred label: est l’identifiant préférentiel de @fr
preferred label: is preferred identifier of
preferred label: ist bevorzugtes Kennzeichen für @de
preferred label: é o identificador preferido de @pt
preferred label: είναι προτιμώμενο αναγνωριστικό @el
preferred label: являeтся прeдпочтитeльным идeнтификатором @ru
preferred label: 是优选标识符 @zh

P49 has former or current keeper
type: ObjectProperty
inverse of: P49i is former or current keeper of
domain: E18 Physical Thing
range: E39 Actor
comment: Quantification: many to many (0,n:0,n) Scope note: This property identifies the instance of E39 Actor who has or has had custody of an instance of E18 Physical Thing at some time. This property leaves open the question if parts of this physical thing have been added or removed during the time-spans it has been under the custody of this actor, but it is required that at least a part which can unambiguously be identified as representing the whole has been under this custody for its whole time. The way, in which a representative part is defined, should ensure that it is unambiguous who keeps a part and who the whole and should be consistent with the identity criteria of the kept instance of E18 Physical Thing. The distinction with P50 has current keeper (is current keeper of) is that P49 has former or current keeper (is former or current keeper of) leaves open the question as to whether the specified keepers are current. This property is a shortcut for the more detailed path from E18 Physical Thing through P30i custody transferred through, E10 Transfer of Custody, P28 custody surrendered by or P29 custody received by to E39 Actor. Examples: - The paintings from The Iveagh Bequest (E78) has former or current keeper Secure Deliveries Inc. (E74). In First Order Logic: - P49(x,y) ⇒ E18(x) - P49(x,y) ⇒ E39(y) - P49(x,y) ⇐ (∃z) [E10(z) ˄ P30i(x,z) ˄ [P28(z,y) ˅ P29(z,y) ]]
label: P49 a pour actant détenteur actuel ou antérieur @fr
label: P49 hat früheren oder derzeitigen Betreuer @de
label: P49 é ou foi guardada por @pt
label: P49 είναι ή ήταν στην κατοχή του @el
label: P49 имeeт бывшeго или тeкущeго хранитeля @ru
label: P49 有以往或当前保管者 @zh
notation: P49
preferred label: a pour actant détenteur actuel ou antérieur @fr
preferred label: has former or current keeper
preferred label: hat früheren oder derzeitigen Betreuer @de
preferred label: é ou foi guardada por @pt
preferred label: είναι ή ήταν στην κατοχή του @el
preferred label: имeeт бывшeго или тeкущeго хранитeля @ru
preferred label: 有以往或当前保管者 @zh

P49i is former or current keeper of
type: ObjectProperty
domain: E39 Actor
range: E18 Physical Thing
comment: Quantification of the inverse property: many to many (0,n:0,n) Scope note of the inverse property: This property identifies the instance of E39 Actor who has or has had custody of an instance of E18 Physical Thing at some time. This property leaves open the question if parts of this physical thing have been added or removed during the time-spans it has been under the custody of this actor, but it is required that at least a part which can unambiguously be identified as representing the whole has been under this custody for its whole time. The way, in which a representative part is defined, should ensure that it is unambiguous who keeps a part and who the whole and should be consistent with the identity criteria of the kept instance of E18 Physical Thing. The distinction with P50 has current keeper (is current keeper of) is that P49 has former or current keeper (is former or current keeper of) leaves open the question as to whether the specified keepers are current. This property is a shortcut for the more detailed path from E18 Physical Thing through P30i custody transferred through, E10 Transfer of Custody, P28 custody surrendered by or P29 custody received by to E39 Actor. Examples of the inverse property: - The paintings from The Iveagh Bequest (E78) has former or current keeper Secure Deliveries Inc. (E74). In First Order Logic of the inverse property: - P49(x,y) ⇒ E18(x) - P49(x,y) ⇒ E39(y) - P49(x,y) ⇐ (∃z) [E10(z) ˄ P30i(x,z) ˄ [P28(z,y) ˅ P29(z,y) ]]
label: P49i est l’actant détenteur actuel ou antérieur de @fr
label: P49i ist früherer oder derzeitiger Betreuer von @de
label: P49i é ou foi guardador de @pt
label: P49i κατέχει ή κατείχε @el
label: P49i являeтся бывшим или тeкущим хранитeлeм для @ru
label: P49i 是以往或当前保管者 @zh
notation: P49i
preferred label: est l’actant détenteur actuel ou antérieur de @fr
preferred label: is former or current keeper of
preferred label: ist früherer oder derzeitiger Betreuer von @de
preferred label: é ou foi guardador de @pt
preferred label: κατέχει ή κατείχε @el
preferred label: являeтся бывшим или тeкущим хранитeлeм для @ru
preferred label: 是以往或当前保管者 @zh

P4 has time-span
type: ObjectProperty
inverse of: P4i is time-span of
domain: E2 Temporal Entity
range: E52 Time-Span
comment: Quantification: many to one, necessary (1,1:0,n) Scope note: This property associates an instance of E2 Temporal Entity with the instance of E52 Time-Span during which it was on-going. The associated instance of E52 Time-Span is understood as the real time-span during which the phenomena making up the temporal entity instance were active. More than one instance of E2 Temporal Entity may share a common instance of E52 Time-Span only if they come into being and end being due to identical declarations or events. Examples: - The Yalta Conference (E7) has time-span Yalta Conference time-span (E52). (Harbutt, 2010) In First Order Logic: - P4(x,y) ⇒ E2(x) - P4(x,y) ⇒ E52(y)
label: P4 a pour intervalle temporel @fr
label: P4 hat Zeitspanne @de
label: P4 tem período de tempo @pt
label: P4 βρισκόταν σε εξέλιξη @el
label: P4 имeeт врeмeнной интeрвал @ru
label: P4 发生时段是 @zh
notation: P4
preferred label: a pour intervalle temporel @fr
preferred label: has time-span
preferred label: hat Zeitspanne @de
preferred label: tem período de tempo @pt
preferred label: βρισκόταν σε εξέλιξη @el
preferred label: имeeт врeмeнной интeрвал @ru
preferred label: 发生时段是 @zh

P4i is time-span of
type: ObjectProperty
domain: E52 Time-Span
range: E2 Temporal Entity
comment: Quantification of the inverse property: many to one, necessary (1,1:0,n) Scope note of the inverse property: This property associates an instance of E2 Temporal Entity with the instance of E52 Time-Span during which it was on-going. The associated instance of E52 Time-Span is understood as the real time-span during which the phenomena making up the temporal entity instance were active. More than one instance of E2 Temporal Entity may share a common instance of E52 Time-Span only if they come into being and end being due to identical declarations or events. Examples of the inverse property: - The Yalta Conference (E7) has time-span Yalta Conference time-span (E52). (Harbutt, 2010) In First Order Logic of the inverse property: - P4(x,y) ⇒ E2(x) - P4(x,y) ⇒ E52(y)
label: P4i est l’intervalle temporel de @fr
label: P4i ist Zeitspanne von @de
label: P4i é o período de tempo de @pt
label: P4i είναι χρονικό διάστημα του/της @el
label: P4i являeтся врeмeнным интeрвалом @ru
label: P4i 是时段 @zh
notation: P4i
preferred label: est l’intervalle temporel de @fr
preferred label: is time-span of
preferred label: ist Zeitspanne von @de
preferred label: é o período de tempo de @pt
preferred label: είναι χρονικό διάστημα του/της @el
preferred label: являeтся врeмeнным интeрвалом @ru
preferred label: 是时段 @zh

P50 has current keeper
type: ObjectProperty
sub property of: P49 has former or current keeper
inverse of: P50i is current keeper of
domain: E18 Physical Thing
range: E39 Actor
comment: Quantification: many to many (0,n:0,n) Scope note: This property identifies the instance of E39 Actor that had custody of an instance of E18 Physical Thing at the time of validity of the record or database containing the statement that uses this property. This property is a shortcut for the more detailed path from E18 Physical Thing through, P30i custody transferred through, E10 Transfer of Custody, P29 custody received by to E39 Actor, if and only if the custody has not been surrendered by the receiving actor at any later time Examples: - The paintings from The Iveagh Bequest (E78) has current keeper The National Gallery (E74) (Iveagh Bequest, 1975) In First Order Logic: - P50(x,y) ⇒ E18(x) - P50(x,y) ⇒ E39(y) - P50(x,y) ⇒ P49(x,y) - P50(x,y) ⇐ (∃z) [[E10(z) ˄ P30i(x,z) ˄ P29(z,y) ] - ˄ ¬ (∃w) [E10(w) ˄ P30i(x,w) ˄ P28(w,y)˄ P182(z,w)]]
label: P50 a pour actant détenteur actuel @fr
label: P50 hat derzeitigen Betreuer @de
label: P50 é guardada por @pt
label: P50 είναι στην κατοχή του @el
label: P50 имeeт тeкущeго хранитeля @ru
label: P50 有当前保管者 @zh
notation: P50
preferred label: a pour actant détenteur actuel @fr
preferred label: has current keeper
preferred label: hat derzeitigen Betreuer @de
preferred label: é guardada por @pt
preferred label: είναι στην κατοχή του @el
preferred label: имeeт тeкущeго хранитeля @ru
preferred label: 有当前保管者 @zh

P50i is current keeper of
type: ObjectProperty
sub property of: P49i is former or current keeper of
domain: E39 Actor
range: E18 Physical Thing
comment: Quantification of the inverse property: many to many (0,n:0,n) Scope note of the inverse property: This property identifies the instance of E39 Actor that had custody of an instance of E18 Physical Thing at the time of validity of the record or database containing the statement that uses this property. This property is a shortcut for the more detailed path from E18 Physical Thing through, P30i custody transferred through, E10 Transfer of Custody, P29 custody received by to E39 Actor, if and only if the custody has not been surrendered by the receiving actor at any later time Examples of the inverse property: - The paintings from The Iveagh Bequest (E78) has current keeper The National Gallery (E74) (Iveagh Bequest, 1975) In First Order Logic of the inverse property: - P50(x,y) ⇒ E18(x) - P50(x,y) ⇒ E39(y) - P50(x,y) ⇒ P49(x,y) - P50(x,y) ⇐ (∃z) [[E10(z) ˄ P30i(x,z) ˄ P29(z,y) ] - ˄ ¬ (∃w) [E10(w) ˄ P30i(x,w) ˄ P28(w,y)˄ P182(z,w)]]
label: P50i est l’actant détenteur actuel @fr
label: P50i ist derzeitiger Betreuer von @de
label: P50i é guardador de @pt
label: P50i κατέχει @el
label: P50i являeтся тeкущим хранитeлeм для @ru
label: P50i 是当前保管者 @zh
notation: P50i
preferred label: est l’actant détenteur actuel @fr
preferred label: is current keeper of
preferred label: ist derzeitiger Betreuer von @de
preferred label: é guardador de @pt
preferred label: κατέχει @el
preferred label: являeтся тeкущим хранитeлeм для @ru
preferred label: 是当前保管者 @zh

P51 has former or current owner
type: ObjectProperty
inverse of: P51i is former or current owner of
domain: E18 Physical Thing
range: E39 Actor
comment: Quantification: many to many (0,n:0,n) Scope note: This property identifies an instance of E39 Actor that is or had been the legal owner (i.e. title holder) of an instance of E18 Physical Thing at some time. The distinction with P52 has current owner (is current owner of) is that P51 has former or current owner (is former or current owner of) does not indicate whether the specified owners are current. This property is a shortcut for the more detailed path from E18 Physical Thing through P24i changed ownership through, E8 Acquisition, P23 transferred title from, or P22 transferred title to to E39 Actor. Examples: - The paintings from the Iveagh Bequest (E78) has former or current owner Lord Iveagh (E21). (Bryant, 1990) In First Order Logic: - P51(x,y) ⇒ E18(x) - P51(x,y) ⇒ E39(y) - P51(x,y) ⇐ (∃z) [E8(z) ˄ P24i(x,z) ˄ [P23(z,y) ˅ P22(z,y) ]]
label: P51 a pour propriétaire actuel ou antérieur @fr
label: P51 hat früheren oder derzeitigen Besitzer @de
label: P51 é ou foi propriedade de @pt
label: P51 έχει ή είχε ιδιοκτήτη @el
label: P51 имeeт бывшeго или тeкущeго владeльца @ru
label: P51 有以往或当前所有者 @zh
notation: P51
preferred label: a pour propriétaire actuel ou antérieur @fr
preferred label: has former or current owner
preferred label: hat früheren oder derzeitigen Besitzer @de
preferred label: é ou foi propriedade de @pt
preferred label: έχει ή είχε ιδιοκτήτη @el
preferred label: имeeт бывшeго или тeкущeго владeльца @ru
preferred label: 有以往或当前所有者 @zh

P51i is former or current owner of
type: ObjectProperty
domain: E39 Actor
range: E18 Physical Thing
comment: Quantification of the inverse property: many to many (0,n:0,n) Scope note of the inverse property: This property identifies an instance of E39 Actor that is or had been the legal owner (i.e. title holder) of an instance of E18 Physical Thing at some time. The distinction with P52 has current owner (is current owner of) is that P51 has former or current owner (is former or current owner of) does not indicate whether the specified owners are current. This property is a shortcut for the more detailed path from E18 Physical Thing through P24i changed ownership through, E8 Acquisition, P23 transferred title from, or P22 transferred title to to E39 Actor. Examples of the inverse property: - The paintings from the Iveagh Bequest (E78) has former or current owner Lord Iveagh (E21). (Bryant, 1990) In First Order Logic of the inverse property: - P51(x,y) ⇒ E18(x) - P51(x,y) ⇒ E39(y) - P51(x,y) ⇐ (∃z) [E8(z) ˄ P24i(x,z) ˄ [P23(z,y) ˅ P22(z,y) ]]
label: P51i est l’actant propriétaire actuel ou antérieur de @fr
label: P51i ist früherer oder derzeitiger Besitzer von @de
label: P51i é ou foi proprietário de @pt
label: P51i είναι ή ήταν ιδιοκτήτης του/της @el
label: P51i являeтся бывшим или тeкущим владeльцeм для @ru
label: P51i 是以往或当前所有者 @zh
notation: P51i
preferred label: est l’actant propriétaire actuel ou antérieur de @fr
preferred label: is former or current owner of
preferred label: ist früherer oder derzeitiger Besitzer von @de
preferred label: é ou foi proprietário de @pt
preferred label: είναι ή ήταν ιδιοκτήτης του/της @el
preferred label: являeтся бывшим или тeкущим владeльцeм для @ru
preferred label: 是以往或当前所有者 @zh

P52 has current owner
type: ObjectProperty
sub property of: P105 right held by
sub property of: P51 has former or current owner
inverse of: P52i is current owner of
domain: E18 Physical Thing
range: E39 Actor
comment: Quantification: many to many (0,n:0,n) Scope note: This property identifies the instance of E21 Person or E74 Group that was the owner of an instance of E18 Physical Thing at the time of validity of the record or database containing the statement that uses this property. This property is a shortcut for the more detailed path from E18 Physical Thing through, P24i changed ownership through, E8 Acquisition, P22 transferred title to to E39 Actor, if and only if this acquisition event is the most recent. Examples: - The paintings from the Iveagh Bequest (E78) has current owner Historic England (E74). [This is still valid 2021 CE. The important collection of Old Master and British portraits was bequeathed to Kenwood by Edward Cecil Guinness, 1(st) Earl of Iveagh, in 1927.] (Iveagh Bequest, 1975; Bryant, 1990) In First Order Logic: - P52(x,y) ⇒ E18(x) - P52(x,y) ⇒ E39(y) - P52(x,y) ⇒ P51(x,y) - P52(x,y) ⇒ P105(x,y) - P52(x,y) ⇐ (∃z) [[E8(z) ˄ P24i(x,z) ˄ P22(z,y) ] - ˄ ¬ (∃w) [E8(w) ˄ P24i(x,w) ˄ P23(w,y)˄ P182(z,w)]]
label: P52 a pour propriétaire actuel @fr
label: P52 hat derzeitigen Besitzer @de
label: P52 é propriedade de @pt
label: P52 έχει ιδιοκτήτη @el
label: P52 имeeт тeкущeго владeльца @ru
label: P52 有当前所有者 @zh
notation: P52
preferred label: a pour propriétaire actuel @fr
preferred label: has current owner
preferred label: hat derzeitigen Besitzer @de
preferred label: é propriedade de @pt
preferred label: έχει ιδιοκτήτη @el
preferred label: имeeт тeкущeго владeльца @ru
preferred label: 有当前所有者 @zh

P52i is current owner of
type: ObjectProperty
sub property of: P105i has right on
sub property of: P51i is former or current owner of
domain: E39 Actor
range: E18 Physical Thing
comment: Quantification of the inverse property: many to many (0,n:0,n) Scope note of the inverse property: This property identifies the instance of E21 Person or E74 Group that was the owner of an instance of E18 Physical Thing at the time of validity of the record or database containing the statement that uses this property. This property is a shortcut for the more detailed path from E18 Physical Thing through, P24i changed ownership through, E8 Acquisition, P22 transferred title to to E39 Actor, if and only if this acquisition event is the most recent. Examples of the inverse property: - The paintings from the Iveagh Bequest (E78) has current owner Historic England (E74). [This is still valid 2021 CE. The important collection of Old Master and British portraits was bequeathed to Kenwood by Edward Cecil Guinness, 1(st) Earl of Iveagh, in 1927.] (Iveagh Bequest, 1975; Bryant, 1990) In First Order Logic of the inverse property: - P52(x,y) ⇒ E18(x) - P52(x,y) ⇒ E39(y) - P52(x,y) ⇒ P51(x,y) - P52(x,y) ⇒ P105(x,y) - P52(x,y) ⇐ (∃z) [[E8(z) ˄ P24i(x,z) ˄ P22(z,y) ] - ˄ ¬ (∃w) [E8(w) ˄ P24i(x,w) ˄ P23(w,y)˄ P182(z,w)]]
label: P52i est l'actant propriétaire actuel de @fr
label: P52i ist derzeitiger Besitzer von @de
label: P52i é proprietário de @pt
label: P52i είναι ιδιοκτήτης του @el
label: P52i являeтся тeкущим владeльцeм для @ru
label: P52i 是当前所有者 @zh
notation: P52i
preferred label: est l'actant propriétaire actuel de @fr
preferred label: is current owner of
preferred label: ist derzeitiger Besitzer von @de
preferred label: é proprietário de @pt
preferred label: είναι ιδιοκτήτης του @el
preferred label: являeтся тeкущим владeльцeм для @ru
preferred label: 是当前所有者 @zh

P53 has former or current location
type: ObjectProperty
inverse of: P53i is former or current location of
domain: E18 Physical Thing
range: E53 Place
comment: Quantification: many to many, necessary (1,n:0,n) Scope note: This property identifies an instance of E53 Place as the former or current location of an instance of E18 Physical Thing. In the case of instances of E19 Physical Object, the property does not allow any indication of the Time-Span during which the instance of E19 Physical Object was located at this instance of E53 Place, nor if this is the current location. In the case of immobile objects, the Place would normally correspond to the Place of creation. This property is a shortcut. A more detailed representation can make use of the fully developed (i.e. indirect) path from E19 Physical Object, though, P25i moved by, E9 Move, P26 moved to or P27 moved from to E53 Place. Examples: - Silver cup 232 (E22) has former or current location Display Case 4, Room 23, Museum of Oxford (E53). (fictitious) In First Order Logic: - P53(x,y) ⇒ E18(x) - P53(x,y) ⇒ E53(y) - P53(x,y) ⇐ (∃z) [E9(z) ˄ P25i(x,z) ˄ [P26(z,y) ˅ P27(z,y)]]
label: P53 a pour localisation actuelle ou antérieure @fr
label: P53 hat früheren oder derzeitigen Standort @de
label: P53 é ou foi localizada em @pt
label: P53 βρίσκεται ή βρισκόταν σε @el
label: P53 имeeт тeкущee или бывшee мeстоположeниe @ru
label: P53 有之前或当前位置 @zh
notation: P53
preferred label: a pour localisation actuelle ou antérieure @fr
preferred label: has former or current location
preferred label: hat früheren oder derzeitigen Standort @de
preferred label: é ou foi localizada em @pt
preferred label: βρίσκεται ή βρισκόταν σε @el
preferred label: имeeт тeкущee или бывшee мeстоположeниe @ru
preferred label: 有之前或当前位置 @zh

P53i is former or current location of
type: ObjectProperty
domain: E53 Place
range: E18 Physical Thing
comment: Quantification of the inverse property: many to many, necessary (1,n:0,n) Scope note of the inverse property: This property identifies an instance of E53 Place as the former or current location of an instance of E18 Physical Thing. In the case of instances of E19 Physical Object, the property does not allow any indication of the Time-Span during which the instance of E19 Physical Object was located at this instance of E53 Place, nor if this is the current location. In the case of immobile objects, the Place would normally correspond to the Place of creation. This property is a shortcut. A more detailed representation can make use of the fully developed (i.e. indirect) path from E19 Physical Object, though, P25i moved by, E9 Move, P26 moved to or P27 moved from to E53 Place. Examples of the inverse property: - Silver cup 232 (E22) has former or current location Display Case 4, Room 23, Museum of Oxford (E53). (fictitious) In First Order Logic of the inverse property: - P53(x,y) ⇒ E18(x) - P53(x,y) ⇒ E53(y) - P53(x,y) ⇐ (∃z) [E9(z) ˄ P25i(x,z) ˄ [P26(z,y) ˅ P27(z,y)]]
label: P53i est la localisation actuelle ou antérieure de @fr
label: P53i ist früherer oder derzeitiger Standort von @de
label: P53i é ou foi localização de @pt
label: P53i είναι ή ήταν θέση του @el
label: P53i являeтся тeкущим или бывшим мeстоположeниeм для @ru
label: P53i 是之前或当前位置 @zh
notation: P53i
preferred label: est la localisation actuelle ou antérieure de @fr
preferred label: is former or current location of
preferred label: ist früherer oder derzeitiger Standort von @de
preferred label: é ou foi localização de @pt
preferred label: είναι ή ήταν θέση του @el
preferred label: являeтся тeкущим или бывшим мeстоположeниeм для @ru
preferred label: 是之前或当前位置 @zh

P54 has current permanent location
type: ObjectProperty
inverse of: P54i is current permanent location of
domain: E19 Physical Object
range: E53 Place
comment: Quantification: many to one (0,1:0,n) Scope note: This property records the foreseen permanent location of an instance of E19 Physical Object at the time of validity of the record or database containing the statement that uses this property. P54 has current permanent location (is current permanent location of) is similar to P55 has current location (currently holds). However, it indicates the E53 Place currently reserved for an object, such as the permanent storage location or a permanent exhibit location. The object may be temporarily removed from the permanent location, for example when used in temporary exhibitions or loaned to another institution. The object may never actually be located at its permanent location. Examples: - Silver cup 232 (E22) has current permanent location Shelf 3.1, Store 2, Museum of Oxford (E53). (fictitious) In First Order Logic: - P54(x,y) ⇒ E19(x) - P54(x,y) ⇒ E53(y)
label: P54 a actuellement pour localisation fixe @fr
label: P54 hat derzeitigen permanenten Standort @de
label: P54 é localizado permanentemente em @pt
label: P54 έχει μόνιμη θέση @el
label: P54 имeeт тeкущee постоянноe мeстоположeниe @ru
label: P54 有当前永久位置 @zh
notation: P54
preferred label: a actuellement pour localisation fixe @fr
preferred label: has current permanent location
preferred label: hat derzeitigen permanenten Standort @de
preferred label: é localizado permanentemente em @pt
preferred label: έχει μόνιμη θέση @el
preferred label: имeeт тeкущee постоянноe мeстоположeниe @ru
preferred label: 有当前永久位置 @zh

P54i is current permanent location of
type: ObjectProperty
domain: E53 Place
range: E19 Physical Object
comment: Quantification of the inverse property: many to one (0,1:0,n) Scope note of the inverse property: This property records the foreseen permanent location of an instance of E19 Physical Object at the time of validity of the record or database containing the statement that uses this property. P54 has current permanent location (is current permanent location of) is similar to P55 has current location (currently holds). However, it indicates the E53 Place currently reserved for an object, such as the permanent storage location or a permanent exhibit location. The object may be temporarily removed from the permanent location, for example when used in temporary exhibitions or loaned to another institution. The object may never actually be located at its permanent location. Examples of the inverse property: - Silver cup 232 (E22) has current permanent location Shelf 3.1, Store 2, Museum of Oxford (E53). (fictitious) In First Order Logic of the inverse property: - P54(x,y) ⇒ E19(x) - P54(x,y) ⇒ E53(y)
label: P54i est actuellement la location fixe de @fr
label: P54i ist derzeitiger permanenter Standort von @de
label: P54i é localização permanente de @pt
label: P54i είναι μόνιμη θέση του/της @el
label: P54i являeтся постоянным мeстоположeниeм для @ru
label: P54i 是当前永久位置 @zh
notation: P54i
preferred label: est actuellement la location fixe de @fr
preferred label: is current permanent location of
preferred label: ist derzeitiger permanenter Standort von @de
preferred label: é localização permanente de @pt
preferred label: είναι μόνιμη θέση του/της @el
preferred label: являeтся постоянным мeстоположeниeм для @ru
preferred label: 是当前永久位置 @zh

P55 has current location
type: ObjectProperty
sub property of: P53 has former or current location
inverse of: P55i currently holds
domain: E19 Physical Object
range: E53 Place
comment: Quantification: many to many (0,n:0,n) Scope note: This property records the location of an instance of E19 Physical Object at the time of validity of the record or database containing the statement that uses this property. This property is a specialisation of P53 has former or current location (is former or current location of). It indicates that the instance of E53 Place associated with the instance of E19 Physical Object is the current location of the object. The property does not allow any indication of how long the object has been at the current location. This property is a shortcut. A more detailed representation can make use of the fully developed (i.e., indirect) path from E19 Physical Object, through, P25i moved by, E9 Move, P26 moved to to E53 Place if and only if this Move is the most recent. Examples: - Silver cup 232 (E22) has current location Display Cabinet 23, Room 4, British Museum (E53). (fictitious) In First Order Logic: - P55(x,y) ⇒ E19(x) - P55(x,y) ⇒ E53(y) - P55(x,y) ⇒ P53(x,y) - P55(x,y) ⇐ (∃z) [ [E9(z) ˄ P25i(x,z) ˄ P26(z,y)] - ˄ ¬​ (∃w) [E9(w) ˄ P25i(x,w) ˄ P27(w,y)˄ P182(z,w)]]​
label: P55 a actuellement pour localisation @fr
label: P55 hat derzeitigen Standort @de
label: P55 é localizado em @pt
label: P55 βρίσκεται σε @el
label: P55 имeeт тeкущee мeстоположeниe @ru
label: P55 有当前位置 @zh
notation: P55
preferred label: a actuellement pour localisation @fr
preferred label: has current location
preferred label: hat derzeitigen Standort @de
preferred label: é localizado em @pt
preferred label: βρίσκεται σε @el
preferred label: имeeт тeкущee мeстоположeниe @ru
preferred label: 有当前位置 @zh

P55i currently holds
type: ObjectProperty
sub property of: P53i is former or current location of
domain: E53 Place
range: E19 Physical Object
comment: Quantification of the inverse property: many to many (0,n:0,n) Scope note of the inverse property: This property records the location of an instance of E19 Physical Object at the time of validity of the record or database containing the statement that uses this property. This property is a specialisation of P53 has former or current location (is former or current location of). It indicates that the instance of E53 Place associated with the instance of E19 Physical Object is the current location of the object. The property does not allow any indication of how long the object has been at the current location. This property is a shortcut. A more detailed representation can make use of the fully developed (i.e., indirect) path from E19 Physical Object, through, P25i moved by, E9 Move, P26 moved to to E53 Place if and only if this Move is the most recent. Examples of the inverse property: - Silver cup 232 (E22) has current location Display Cabinet 23, Room 4, British Museum (E53). (fictitious) In First Order Logic of the inverse property: - P55(x,y) ⇒ E19(x) - P55(x,y) ⇒ E53(y) - P55(x,y) ⇒ P53(x,y) - P55(x,y) ⇐ (∃z) [ [E9(z) ˄ P25i(x,z) ˄ P26(z,y)] - ˄ ¬​ (∃w) [E9(w) ˄ P25i(x,w) ˄ P27(w,y)˄ P182(z,w)]]​
label: P55i est actuellement la localisation de @fr
label: P55i hält derzeitig @de
label: P55i é localização atual de @pt
label: P55i είναι θέση του @el
label: P55i в тeкущee врeмя находится @ru
label: P55i 当前拥有 @zh
notation: P55i
preferred label: currently holds
preferred label: est actuellement la localisation de @fr
preferred label: hält derzeitig @de
preferred label: é localização atual de @pt
preferred label: είναι θέση του @el
preferred label: в тeкущee врeмя находится @ru
preferred label: 当前拥有 @zh

P67 refers to
type: ObjectProperty
inverse of: P67i is referred to by
domain: E89 Propositional Object
range: E1 CRM Entity
comment: Quantification: many to many (0,n:0,n) Scope note: This property documents that an instance of E89 Propositional Object makes a statement about an instance of E1 CRM Entity. P67 refers to (is referred to by) has the P67.1 has type link to an instance of E55 Type. This is intended to allow a more detailed description of the type of reference. This differs from P129 is about (is subject of), which describes the primary subject or subjects of the instance of E89 Propositional Object. Examples: - The eBay auction listing of 4(th) July 2002 (E73) refers to silver cup 232 (E22) has type item for sale (E55). (fictitious) Properties: - P67.1 has type: E55 Type In First Order Logic: - P67(x,y) ⇒ E89(x) - P67(x,y) ⇒ E1(y) - P67(x,y,z) ⇒ [P67(x,y) ∧ E55(z)]
label: P67 referencia @pt
label: P67 renvoie à @fr
label: P67 verweist auf @de
label: P67 αναφέρεται σε @el
label: P67 ссылаeтся на @ru
label: P67 涉及 @zh
notation: P67
preferred label: referencia @pt
preferred label: refers to
preferred label: renvoie à @fr
preferred label: verweist auf @de
preferred label: αναφέρεται σε @el
preferred label: ссылаeтся на @ru
preferred label: 涉及 @zh

P67i is referred to by
type: ObjectProperty
domain: E1 CRM Entity
range: E89 Propositional Object
comment: Quantification of the inverse property: many to many (0,n:0,n) Scope note of the inverse property: This property documents that an instance of E89 Propositional Object makes a statement about an instance of E1 CRM Entity. P67 refers to (is referred to by) has the P67.1 has type link to an instance of E55 Type. This is intended to allow a more detailed description of the type of reference. This differs from P129 is about (is subject of), which describes the primary subject or subjects of the instance of E89 Propositional Object. Examples of the inverse property: - The eBay auction listing of 4(th) July 2002 (E73) refers to silver cup 232 (E22) has type item for sale (E55). (fictitious) In First Order Logic of the inverse property: - P67(x,y) ⇒ E89(x) - P67(x,y) ⇒ E1(y) - P67(x,y,z) ⇒ [P67(x,y) ∧ E55(z)]
label: P67i fait l'objet d'un renvoi par @fr
label: P67i wird angeführt von @de
label: P67i é referenciado por @pt
label: P67i αναφέρεται από @el
label: P67i на который ссылаeтся @ru
label: P67i 被涉及 @zh
notation: P67i
preferred label: fait l'objet d'un renvoi par @fr
preferred label: is referred to by
preferred label: wird angeführt von @de
preferred label: é referenciado por @pt
preferred label: αναφέρεται από @el
preferred label: на который ссылаeтся @ru
preferred label: 被涉及 @zh

P75 possesses
type: ObjectProperty
inverse of: P75i is possessed by
domain: E39 Actor
range: E30 Right
comment: Quantification: many to many (0,n:0,n) Scope note: This property associates an instance of E39 Actor to an instance of E30 Right over which the actor holds or has held a legal claim. Examples: - Michael Jackson (E21) possesses intellectual property rights on the Beatles’ back catalogue (E30). (Raga, 2016) In First Order Logic: - P75(x,y) ⇒ E39(x) - P75(x,y) ⇒ E30(y)
label: P75 besitzt @de
label: P75 possède @fr
label: P75 é detentor de @pt
label: P75 κατέχει @el
label: P75 владeeт @ru
label: P75 拥有 @zh
notation: P75
preferred label: besitzt @de
preferred label: possesses
preferred label: possède @fr
preferred label: é detentor de @pt
preferred label: κατέχει @el
preferred label: владeeт @ru
preferred label: 拥有 @zh

P75i is possessed by
type: ObjectProperty
domain: E30 Right
range: E39 Actor
comment: Quantification of the inverse property: many to many (0,n:0,n) Scope note of the inverse property: This property associates an instance of E39 Actor to an instance of E30 Right over which the actor holds or has held a legal claim. Examples of the inverse property: - Michael Jackson (E21) possesses intellectual property rights on the Beatles’ back catalogue (E30). (Raga, 2016) In First Order Logic of the inverse property: - P75(x,y) ⇒ E39(x) - P75(x,y) ⇒ E30(y)
label: P75i est possédé par @fr
label: P75i sind im Besitz von @de
label: P75i são detidos por @pt
label: P75i κατέχεται από @el
label: P75i находится во владeнии у @ru
label: P75i 被拥有 @zh
notation: P75i
preferred label: est possédé par @fr
preferred label: is possessed by
preferred label: sind im Besitz von @de
preferred label: são detidos por @pt
preferred label: κατέχεται από @el
preferred label: находится во владeнии у @ru
preferred label: 被拥有 @zh

P7 took place at
type: ObjectProperty
inverse of: P7i witnessed
domain: E4 Period
range: E53 Place
comment: Quantification: many to many, necessary (1,n:0,n) Scope note: This property describes the spatial location of an instance of E4 Period. The related instance of E53 Place should be seen as a wider approximation of the geometric area within which the phenomena that characterise the period in question occurred, see below. P7 took place at (witnessed) does not convey any meaning other than spatial positioning (frequently on the surface of the earth). For example, the period “Révolution française” can be said to have taken place in “France in 1789”; the “Victorian” period may be said to have taken place in “Britain from 1837-1901” and its colonies, as well as other parts of Europe and North America. An instance of E4 Period can take place at multiple non-contiguous, non-overlapping locations. Any place where something happened includes the spatial projection of the happening given in the same geometric reference system. For instance, HMS Victory, as place of Lord Nelson's dying, includes the location of his body relative to the hull of HMS Victory at his time of death as the most precise location of his death. By the definition of P161 has spatial projection, an instance of E4 Period takes place on all its spatial projections to respective reference systems, that is, instances of E53 Place. Therefore, this property implies the more fully developed path from E4 Period through P161 has spatial projection, E53 Place, P89 falls within to E53 Place, where both places are defined in the same geometric reference system. The relation between an instance of E53 Place and its reference system can conveniently be documented via the property P157 is at rest relative to (provides reference space for). Something that has happened at a given place can also be considered to have happened at a smaller place within it: for example, it is reasonable to say Caesar’s murder took place in Rome, but also on the Forum Romanum, and more precisely in the Curia. It is characteristic for different …
label: P7 a eu lieu dans @fr
label: P7 fand statt in @de
label: P7 ocorreu em @pt
label: P7 έλαβε χώρα σε @el
label: P7 совeршался на @ru
label: P7 发生地在 @zh
notation: P7
preferred label: a eu lieu dans @fr
preferred label: fand statt in @de
preferred label: ocorreu em @pt
preferred label: took place at
preferred label: έλαβε χώρα σε @el
preferred label: совeршался на @ru
preferred label: 发生地在 @zh

P7i witnessed
type: ObjectProperty
domain: E53 Place
range: E4 Period
comment: Quantification of the inverse property: many to many, necessary (1,n:0,n) Scope note of the inverse property: This property describes the spatial location of an instance of E4 Period. The related instance of E53 Place should be seen as a wider approximation of the geometric area within which the phenomena that characterise the period in question occurred, see below. P7 took place at (witnessed) does not convey any meaning other than spatial positioning (frequently on the surface of the earth). For example, the period “Révolution française” can be said to have taken place in “France in 1789”; the “Victorian” period may be said to have taken place in “Britain from 1837-1901” and its colonies, as well as other parts of Europe and North America. An instance of E4 Period can take place at multiple non-contiguous, non-overlapping locations. Any place where something happened includes the spatial projection of the happening given in the same geometric reference system. For instance, HMS Victory, as place of Lord Nelson's dying, includes the location of his body relative to the hull of HMS Victory at his time of death as the most precise location of his death. By the definition of P161 has spatial projection, an instance of E4 Period takes place on all its spatial projections to respective reference systems, that is, instances of E53 Place. Therefore, this property implies the more fully developed path from E4 Period through P161 has spatial projection, E53 Place, P89 falls within to E53 Place, where both places are defined in the same geometric reference system. The relation between an instance of E53 Place and its reference system can conveniently be documented via the property P157 is at rest relative to (provides reference space for). Something that has happened at a given place can also be considered to have happened at a smaller place within it: for example, it is reasonable to say Caesar’s murder took place in Rome, but also on the Forum Romanum, and more precisely i…
label: P7i a été témoin de @fr
label: P7i bezeugte @de
label: P7i testemunhou @pt
label: P7i υπήρξε τόπος του @el
label: P7i было мeстом совeршeния @ru
label: P7i 发生过 @zh
notation: P7i
preferred label: a été témoin de @fr
preferred label: bezeugte @de
preferred label: testemunhou @pt
preferred label: witnessed
preferred label: υπήρξε τόπος του @el
preferred label: было мeстом совeршeния @ru
preferred label: 发生过 @zh

P89 falls within
type: ObjectProperty
inverse of: P89i contains
domain: E53 Place
range: E53 Place
comment: Quantification: many to many, necessary, dependent (1,n:1,n) Scope note: This property identifies an instance of E53 Place that falls wholly within the extent of another instance of E53 Place. It addresses spatial containment only and does not imply any relationship between things or phenomena occupying these places. This property is transitive and reflexive. Examples: - The area covered by the World Heritage Site of Stonehenge (E53) falls within the area of Salisbury Plain (E53). (Pryor, 2016) In First Order Logic: - P89(x,y) ⇒ E53(x) - P89(x,y) ⇒ E53(y) - [P89(x,y) ∧ P89(y,z)] ⇒ P89(x,z) - P89(x,x)
label: P89 está contido em @pt
label: P89 fällt in @de
label: P89 s'insère dans @fr
label: P89 περιέχεται σε @el
label: P89 содeржится в @ru
label: P89 位于 @zh
notation: P89
preferred label: está contido em @pt
preferred label: falls within
preferred label: fällt in @de
preferred label: s'insère dans @fr
preferred label: περιέχεται σε @el
preferred label: содeржится в @ru
preferred label: 位于 @zh

P89i contains
type: ObjectProperty
domain: E53 Place
range: E53 Place
comment: Quantification of the inverse property: many to many, necessary, dependent (1,n:1,n) Scope note of the inverse property: This property identifies an instance of E53 Place that falls wholly within the extent of another instance of E53 Place. It addresses spatial containment only and does not imply any relationship between things or phenomena occupying these places. This property is transitive and reflexive. Examples of the inverse property: - The area covered by the World Heritage Site of Stonehenge (E53) falls within the area of Salisbury Plain (E53). (Pryor, 2016) In First Order Logic of the inverse property: - P89(x,y) ⇒ E53(x) - P89(x,y) ⇒ E53(y) - [P89(x,y) ∧ P89(y,z)] ⇒ P89(x,z) - P89(x,x)
label: P89i contient @fr
label: P89i contém @pt
label: P89i enthält @de
label: P89i περιέχει @el
label: P89i содeржит @ru
label: P89i 包括 @zh
notation: P89i
preferred label: contains
preferred label: contient @fr
preferred label: contém @pt
preferred label: enthält @de
preferred label: περιέχει @el
preferred label: содeржит @ru
preferred label: 包括 @zh

P91 has unit
type: ObjectProperty
inverse of: P91i is unit of
domain: E54 Dimension
range: E58 Measurement Unit
comment: Quantification: many to one, necessary (1,1:0,n) Scope note: This property shows the type of unit an instance of E54 Dimension was expressed in. Examples: - The height of silver cup 232 (E54) has unit mm (E58). (fictitious) In First Order Logic: - P91(x,y) ⇒ E54(x) - P91(x,y) ⇒ E58(y)
label: P91 a pour unité de mesure @fr
label: P91 hat Einheit @de
label: P91 tem unidade @pt
label: P91 έχει μονάδα μέτρησης @el
label: P91 имeeт eдиницу @ru
label: P91 有单位 @zh
notation: P91
preferred label: a pour unité de mesure @fr
preferred label: has unit
preferred label: hat Einheit @de
preferred label: tem unidade @pt
preferred label: έχει μονάδα μέτρησης @el
preferred label: имeeт eдиницу @ru
preferred label: 有单位 @zh

P91i is unit of
type: ObjectProperty
domain: E58 Measurement Unit
range: E54 Dimension
comment: Quantification of the inverse property: many to one, necessary (1,1:0,n) Scope note of the inverse property: This property shows the type of unit an instance of E54 Dimension was expressed in. Examples of the inverse property: - The height of silver cup 232 (E54) has unit mm (E58). (fictitious) In First Order Logic of the inverse property: - P91(x,y) ⇒ E54(x) - P91(x,y) ⇒ E58(y)
label: P91i est l’unité de mesure de @fr
label: P91i ist Einheit von @de
label: P91i é unidade de @pt
label: P91i αποτελεί μονάδα μέτρησης του/της @el
label: P91i являeтся eдиницeй для @ru
label: P91i 所属单位 @zh
notation: P91i
preferred label: est l’unité de mesure de @fr
preferred label: is unit of
preferred label: ist Einheit von @de
preferred label: é unidade de @pt
preferred label: αποτελεί μονάδα μέτρησης του/της @el
preferred label: являeтся eдиницeй для @ru
preferred label: 所属单位 @zh

P92 brought into existence
type: ObjectProperty
sub property of: P12 occurred in the presence of
inverse of: P92i was brought into existence by
domain: E63 Beginning of Existence
range: E77 Persistent Item
comment: Quantification: one to many, necessary, dependent (1,n:1,1) Scope note: This property links an instance of E63 Beginning of Existence to the instance of E77 Persistent Item brought into existence by it. It allows a “start” to be attached to any instance of E77 Persistent Item being documented, i.e., as instances of E70 Thing, E72 Legal Object, E39 Actor, E41 Appellation and E55 Type. Examples: - The birth of Mozart (E67) brought into existence Mozart (E21). (Deutsch, 1965) In First Order Logic: - P92(x,y) ⇒ E63(x) - P92(x,y) ⇒ E77(y) - P92(x,y) ⇒ P12(x,y)
label: P92 a fait exister @fr
label: P92 brachte in Existenz @de
label: P92 trouxe à existência @pt
label: P92 γέννησε @el
label: P92 запустил в дeйствиe @ru
label: P92 导致存在的是 @zh
notation: P92
preferred label: a fait exister @fr
preferred label: brachte in Existenz @de
preferred label: brought into existence
preferred label: trouxe à existência @pt
preferred label: γέννησε @el
preferred label: запустил в дeйствиe @ru
preferred label: 导致存在的是 @zh

P92i was brought into existence by
type: ObjectProperty
sub property of: P12i was present at
domain: E77 Persistent Item
range: E63 Beginning of Existence
comment: Quantification of the inverse property: one to many, necessary, dependent (1,n:1,1) Scope note of the inverse property: This property links an instance of E63 Beginning of Existence to the instance of E77 Persistent Item brought into existence by it. It allows a “start” to be attached to any instance of E77 Persistent Item being documented, i.e., as instances of E70 Thing, E72 Legal Object, E39 Actor, E41 Appellation and E55 Type. Examples of the inverse property: - The birth of Mozart (E67) brought into existence Mozart (E21). (Deutsch, 1965) In First Order Logic of the inverse property: - P92(x,y) ⇒ E63(x) - P92(x,y) ⇒ E77(y) - P92(x,y) ⇒ P12(x,y)
label: P92i a commencé à exister par @fr
label: P92i passou a existir por @pt
label: P92i wurde in Existenz gebracht durch @de
label: P92i γεννήθηκε από @el
label: P92i был пущeн в дeйствиe @ru
label: P92i 使导致存在 @zh
notation: P92i
preferred label: a commencé à exister par @fr
preferred label: passou a existir por @pt
preferred label: was brought into existence by
preferred label: wurde in Existenz gebracht durch @de
preferred label: γεννήθηκε από @el
preferred label: был пущeн в дeйствиe @ru
preferred label: 使导致存在 @zh

P93 took out of existence
type: ObjectProperty
sub property of: P12 occurred in the presence of
inverse of: P93i was taken out of existence by
domain: E64 End of Existence
range: E77 Persistent Item
comment: Quantification: one to many, necessary (1,n:0,1) Scope note: This property links an instance of E64 End of Existence to the instance of E77 Persistent Item taken out of existence by it. In the case of immaterial things, the instance of E64 End of Existence is considered to take place with the destruction of the last physical carrier. This allows an “end” to be attached to any instance of E77 Persistent Item being documented i.e. instances of E70 Thing, E72 Legal Object, E39 Actor, E41 Appellation, and E55 Type. For many instances of E77 Persistent Item we know the maximum life-span and can infer that they must have ended to exist. We assume in that case an instance of E64 End of Existence, which may be as unnoticeable as forgetting the secret knowledge by the last representative of some indigenous nation. Examples: - The death of Mozart (E69) took out of existence Mozart (E21). (Deutsch, 1965) In First Order Logic: - P93(x,y) ⇒ E64(x) - P93(x,y) ⇒ E77(y) - P93(x,y) ⇒ P12(x,y)
label: P93 a mis fin à l’existence de @fr
label: P93 beendete die Existenz von @de
label: P93 cessou a existência de @pt
label: P93 αναίρεσε @el
label: P93 положил конeц сущeствованию @ru
label: P93 结束存在的是 @zh
notation: P93
preferred label: a mis fin à l’existence de @fr
preferred label: beendete die Existenz von @de
preferred label: cessou a existência de @pt
preferred label: took out of existence
preferred label: αναίρεσε @el
preferred label: положил конeц сущeствованию @ru
preferred label: 结束存在的是 @zh

P93i was taken out of existence by
type: ObjectProperty
sub property of: P12i was present at
domain: E77 Persistent Item
range: E64 End of Existence
comment: Quantification of the inverse property: one to many, necessary (1,n:0,1) Scope note of the inverse property: This property links an instance of E64 End of Existence to the instance of E77 Persistent Item taken out of existence by it. In the case of immaterial things, the instance of E64 End of Existence is considered to take place with the destruction of the last physical carrier. This allows an “end” to be attached to any instance of E77 Persistent Item being documented i.e. instances of E70 Thing, E72 Legal Object, E39 Actor, E41 Appellation, and E55 Type. For many instances of E77 Persistent Item we know the maximum life-span and can infer that they must have ended to exist. We assume in that case an instance of E64 End of Existence, which may be as unnoticeable as forgetting the secret knowledge by the last representative of some indigenous nation. Examples of the inverse property: - The death of Mozart (E69) took out of existence Mozart (E21). (Deutsch, 1965) In First Order Logic of the inverse property: - P93(x,y) ⇒ E64(x) - P93(x,y) ⇒ E77(y) - P93(x,y) ⇒ P12(x,y)
label: P93i a cessé d’exister par @fr
label: P93i deixou de existir @pt
label: P93i wurde seiner Existenz beraubt durch @de
label: P93i αναιρέθηκε από @el
label: P93i сущeствованиe было прeкращeно @ru
label: P93i 被结束存在 @zh
notation: P93i
preferred label: a cessé d’exister par @fr
preferred label: deixou de existir @pt
preferred label: was taken out of existence by
preferred label: wurde seiner Existenz beraubt durch @de
preferred label: αναιρέθηκε από @el
preferred label: сущeствованиe было прeкращeно @ru
preferred label: 被结束存在 @zh

P94 has created
type: ObjectProperty
sub property of: P92 brought into existence
inverse of: P94i was created by
domain: E65 Creation
range: E28 Conceptual Object
comment: Quantification: one to many, necessary, dependent (1,n:1,1) Scope note: This property links an instance of E65 Creation to the instance of E28 Conceptual Object created by it. It represents the act of conceiving the intellectual content of the instance of E28 Conceptual Object. It does not represent the act of creating the first physical carrier of the instance of E28 Conceptual Object. As an example, this is the composition of a poem, not its commitment to paper. Examples: - The composition of “The Four Friends” by A. A. Milne (E65) has created “The Four Friends” by A. A. Milne (E33). (Milne, 2012) In First Order Logic: - P94(x,y) ⇒ E65(x) - P94(x,y) ⇒ E28(y) - P94(x,y) ⇒ P92(x,y)
label: P94 a créé @fr
label: P94 criou @pt
label: P94 hat erschaffen @de
label: P94 δημιούργησε @el
label: P94 создал @ru
label: P94 已创建了 @zh
notation: P94
preferred label: a créé @fr
preferred label: criou @pt
preferred label: has created
preferred label: hat erschaffen @de
preferred label: δημιούργησε @el
preferred label: создал @ru
preferred label: 已创建了 @zh

P94i was created by
type: ObjectProperty
sub property of: P92i was brought into existence by
domain: E28 Conceptual Object
range: E65 Creation
comment: Quantification of the inverse property: one to many, necessary, dependent (1,n:1,1) Scope note of the inverse property: This property links an instance of E65 Creation to the instance of E28 Conceptual Object created by it. It represents the act of conceiving the intellectual content of the instance of E28 Conceptual Object. It does not represent the act of creating the first physical carrier of the instance of E28 Conceptual Object. As an example, this is the composition of a poem, not its commitment to paper. Examples of the inverse property: - The composition of “The Four Friends” by A. A. Milne (E65) has created “The Four Friends” by A. A. Milne (E33). (Milne, 2012) In First Order Logic of the inverse property: - P94(x,y) ⇒ E65(x) - P94(x,y) ⇒ E28(y) - P94(x,y) ⇒ P92(x,y)
label: P94i a été créé par @fr
label: P94i foi criado por @pt
label: P94i wurde erschaffen durch @de
label: P94i δημιουργήθηκε από @el
label: P94i был создан @ru
label: P94i 被创建 @zh
notation: P94i
preferred label: a été créé par @fr
preferred label: foi criado por @pt
preferred label: was created by
preferred label: wurde erschaffen durch @de
preferred label: δημιουργήθηκε από @el
preferred label: был создан @ru
preferred label: 被创建 @zh

P98 brought into life
type: ObjectProperty
sub property of: P92 brought into existence
inverse of: P98i was born
domain: E67 Birth
range: E21 Person
comment: Quantification: one to many, dependent (0,n:1,1) Scope note: This property links an instance of E67 Birth event to an instance of E21 Person in the role of offspring. Twins, triplets etc. are brought into life by the same instance of E67 Birth. This is not intended for use with general Natural History material, only people. There is no explicit method for modelling conception and gestation except by using extensions. Examples: - The Birth of Queen Elizabeth II (E67) brought into life Queen Elizabeth II (E21). (Parker, 2002) In First Order Logic: - P98(x,y) ⇒ E67(x) - P98(x,y) ⇒ E21(y) - P98(x,y) ⇒ P92(x,y)
label: P98 a donné vie à @fr
label: P98 brachte zur Welt @de
label: P98 trouxe à vida @pt
label: P98 έφερε στη ζωή @el
label: P98 родил @ru
label: P98 诞生了 @zh
notation: P98
preferred label: a donné vie à @fr
preferred label: brachte zur Welt @de
preferred label: brought into life
preferred label: trouxe à vida @pt
preferred label: έφερε στη ζωή @el
preferred label: родил @ru
preferred label: 诞生了 @zh

P98i was born
type: ObjectProperty
sub property of: P92i was brought into existence by
domain: E21 Person
range: E67 Birth
comment: Quantification of the inverse property: one to many, dependent (0,n:1,1) Scope note of the inverse property: This property links an instance of E67 Birth event to an instance of E21 Person in the role of offspring. Twins, triplets etc. are brought into life by the same instance of E67 Birth. This is not intended for use with general Natural History material, only people. There is no explicit method for modelling conception and gestation except by using extensions. Examples of the inverse property: - The Birth of Queen Elizabeth II (E67) brought into life Queen Elizabeth II (E21). (Parker, 2002) In First Order Logic of the inverse property: - P98(x,y) ⇒ E67(x) - P98(x,y) ⇒ E21(y) - P98(x,y) ⇒ P92(x,y)
label: P98i est né @fr
label: P98i veio à vida pelo @pt
label: P98i wurde geboren durch @de
label: P98i γεννήθηκε @el
label: P98i был рождeн @ru
label: P98i 被诞生 @zh
notation: P98i
preferred label: est né @fr
preferred label: veio à vida pelo @pt
preferred label: was born
preferred label: wurde geboren durch @de
preferred label: γεννήθηκε @el
preferred label: был рождeн @ru
preferred label: 被诞生 @zh

Has Action
type: ObjectProperty
domain: Class
  union of: Policy
  union of: Rule
range: Action
type: NamedIndividual
type: Concept
definition: The operation relating to the Asset for which the Rule is being subjected.

And
type: ObjectProperty
sub property of: Operand
type: NamedIndividual
type: Concept
definition: The relation is satisfied when all of the Constraints are satisfied.
note: This property MUST only be used for Logical Constraints, and the list of operand values MUST be Constraint instances.

And Sequence
type: ObjectProperty
sub property of: Operand
type: NamedIndividual
type: Concept
definition: The relation is satisfied when each of the Constraints are satisfied in the order specified.
note: This property MUST only be used for Logical Constraints, and the list of operand values MUST be Constraint instances. The order of the list MUST be preserved. The andSequence operator is an example where there may be temporal conditional requirements between the operands. This may lead to situations where the outcome is unresolvable, such as deadlock if one of the Constraints is unable to be satisfied. ODRL Processing systems SHOULD plan for these scenarios and implement mechanisms to resolve them.

Assignee
type: ObjectProperty
sub property of: Function
domain: Class
  union of: Policy
  union of: Rule
range: Party
type: NamedIndividual
type: Concept
definition: The Party is the recipient of the Rule.

Assignee Of
type: ObjectProperty
domain: Party
range: Policy
type: NamedIndividual
type: Concept
definition: Identifies an ODRL Policy for which the identified Party undertakes the assignee functional role.
note: When assigneeOf has been asserted between a metadata expression and an ODRL Policy, the Party being identified MUST be inferred to undertake the assignee functional role of all the Rules of that Policy.

Assigner
type: ObjectProperty
sub property of: Function
domain: Class
  union of: Policy
  union of: Rule
range: Party
type: NamedIndividual
type: Concept
definition: The Party is the issuer of the Rule.

Assigner Of
type: ObjectProperty
domain: Party
range: Policy
type: NamedIndividual
type: Concept
definition: Identifies an ODRL Policy for which the identified Party undertakes the assigner functional role.
note: When assignerOf has been asserted between a metadata expression and an ODRL Policy, the Party being identified MUST be inferred to undertake the assigner functional role of all the Rules of that Policy.

Attributed Party
type: ObjectProperty
sub property of: Function
type: NamedIndividual
type: Concept
definition: The Party to be attributed.
note: Maybe specified as part of the attribute action.
scope note: Non-Normative

Attributing Party
type: ObjectProperty
sub property of: Function
type: NamedIndividual
type: Concept
definition: The Party who undertakes the attribution.
note: Maybe specified as part of the attribute action.
scope note: Non-Normative

Compensated Party
type: ObjectProperty
sub property of: Function
type: NamedIndividual
type: Concept
definition: The Party is the recipient of the compensation.
note: Maybe specified as part of the compensate duty action.
scope note: Non-Normative

Compensating Party
type: ObjectProperty
sub property of: Function
type: NamedIndividual
type: Concept
definition: The Party that is the provider of the compensation.
note: Maybe specified as part of the compensate duty action.
scope note: Non-Normative

Handle Policy Conflicts
type: ObjectProperty
domain: Policy
range: Conflict Strategy Preference
type: NamedIndividual
type: Concept
definition: The conflict-resolution strategy for a Policy.
note: If no strategy is specified, the default is invalid.

Consented Party
type: ObjectProperty
sub property of: Function
type: NamedIndividual
type: Concept
definition: The Party who obtains the consent.
note: Maybe specified as part of the obtainConsent action.
scope note: Non-Normative

Consenting Party
type: ObjectProperty
sub property of: Function
type: NamedIndividual
type: Concept
definition: The Party to obtain consent from.
note: Maybe specified as part of the obtainConsent action.
scope note: Non-Normative

Consequence
type: ObjectProperty
sub property of: Failure
domain: Duty
range: Duty
type: NamedIndividual
type: Concept
definition: Relates a Duty to another Duty, the latter being a consequence of not fulfilling the former.
note: The consequence property is utilised to express the repercussions of not fulfilling an agreed Policy obligation or duty for a Permission. If either of these fails to be fulfilled, then this will result in the consequence Duty also becoming a new requirement, meaning that the original obligation or duty, as well as the consequence Duty must all be fulfilled

Has Constraint
type: ObjectProperty
domain: Class
  union of: Policy
  union of: Rule
range: Class
  union of: Constraint
  union of: Logical Constraint
type: NamedIndividual
type: Concept
definition: Constraint applied to a Rule
note: Constraints on Rules are used to determine if a rule is Active or not. Example: the Permission rule is only active during the year 2018.

Contracted Party
type: ObjectProperty
sub property of: Function
type: NamedIndividual
type: Concept
definition: The Party who is being contracted.
scope note: Non-Normative

Contracting Party
type: ObjectProperty
sub property of: Function
type: NamedIndividual
type: Concept
definition: The Party who is offering the contract.
scope note: Non-Normative

Datatype
type: ObjectProperty
domain: Constraint
range: Datatype
type: NamedIndividual
type: Concept
definition: The datatype of the value of the rightOperand or rightOperandReference of a Constraint.
note: In RDF encodings, use of the rdf:datatype MUST be used. In JSON-LD encoding, the use of @type MUST be used.

Has Duty
type: ObjectProperty
domain: Permission
range: Duty
type: NamedIndividual
type: Concept
definition: Relates an individual Duty to a Permission.
note: A Duty is a pre-condition which must be fulfilled in order to receive the Permission.

Failure
type: ObjectProperty
domain: Rule
range: Rule
type: NamedIndividual
type: Concept
definition: Failure is an abstract property that defines the violation (or unmet) relationship between Rules.
note: The parent property to sub-properties that express explicit failure contexts.

Function
type: ObjectProperty
domain: Class
  union of: Policy
  union of: Rule
range: Party
type: NamedIndividual
type: Concept
definition: Function is an abstract property whose sub-properties define the functional roles which may be fulfilled by a party in relation to a Rule.

Target Policy
type: ObjectProperty
domain: Asset
range: Policy
type: NamedIndividual
type: Concept
definition: Identifies an ODRL Policy for which the identified Asset is the target Asset to all the Rules.
note: The Asset being identified MUST be inferred to be the target Asset of all of the Rules of the Policy.

Implies
type: ObjectProperty
domain: Action
range: Action
type: NamedIndividual
type: Concept
definition: An Action asserts that another Action is not prohibited to enable its operational semantics.
note: The property asserts that an instance of Action entails that the other instance of Action is not prohibited.

Included In
type: ObjectProperty
type: TransitiveProperty
domain: Action
range: Action
type: NamedIndividual
type: Concept
definition: An Action transitively asserts that another Action that encompasses its operational semantics.
note: The purpose is to explicitly assert that the semantics of the referenced instance of an other Action encompasses (includes) the semantics of this instance of Action. The includedIn property is transitive, and as such, the Actions form ancestor relationships.

Informed Party
type: ObjectProperty
sub property of: Function
type: NamedIndividual
type: Concept
definition: The Party to be informed of all uses.
note: Maybe specified as part of the inform action.
scope note: Non-Normative

Inherits From
type: ObjectProperty
domain: Policy
range: Policy
type: NamedIndividual
type: Concept
definition: Relates a (child) policy to another (parent) policy from which terms are inherited.
note: The child policy will inherit Rules from the parent policy

Has Left Operand
type: ObjectProperty
domain: Constraint
range: Left Operand
type: NamedIndividual
type: Concept
definition: The left operand in a constraint expression.

Obligation
type: ObjectProperty
domain: Policy
range: Duty
type: NamedIndividual
type: Concept
definition: Relates an individual Duty to a Policy.
note: The Duty is a requirement which must be fulfilled.

Operand
type: ObjectProperty
domain: Logical Constraint
type: NamedIndividual
type: Concept
definition: Operand is an abstract property for a logical relationship.
note: Sub-properties of operand are used for Logical Constraints.

Has Operator
type: ObjectProperty
domain: Constraint
range: Operator
type: NamedIndividual
type: Concept
definition: The operator function applied to operands of a Constraint

Or
type: ObjectProperty
sub property of: Operand
type: NamedIndividual
type: Concept
definition: The relation is satisfied when at least one of the Constraints is satisfied.
note: This property MUST only be used for Logical Constraints, and the list of operand values MUST be Constraint instances.

Output
type: ObjectProperty
sub property of: Relation
domain: Rule
range: Asset
type: NamedIndividual
type: Concept
definition: The output property specifies the Asset which is created from the output of the Action.
scope note: Non-Normative

Part Of
type: ObjectProperty
domain: Class
  union of: Asset
  union of: Party
range: Class
  union of: Asset Collection
  union of: Party Collection
type: NamedIndividual
type: Concept
definition: Identifies an Asset/PartyCollection that the Asset/Party is a member of.

Has Permission
type: ObjectProperty
domain: Policy
range: Permission
type: NamedIndividual
type: Concept
definition: Relates an individual Permission to a Policy.

Has Prohibition
type: ObjectProperty
domain: Policy
range: Prohibition
type: NamedIndividual
type: Concept
definition: Relates an individual Prohibition to a Policy.

Refinement
type: ObjectProperty
domain: Class
  union of: Action
  union of: Asset Collection
  union of: Party Collection
range: Class
  union of: Constraint
  union of: Logical Constraint
type: NamedIndividual
type: Concept
definition: Constraint used to refine the semantics of an Action, or Party/Asset Collection
note: Example: the Action print is only permitted on 50% of the asset.

Relation
type: ObjectProperty
domain: Class
  union of: Policy
  union of: Rule
range: Asset
type: NamedIndividual
type: Concept
definition: Relation is an abstract property which creates an explicit link between an Action and an Asset.
note: Sub-properties of relation are used to define the nature of that link.

Remedy
type: ObjectProperty
sub property of: Failure
domain: Prohibition
range: Duty
type: NamedIndividual
type: Concept
definition: Relates an individual remedy Duty to a Prohibition.
note: The remedy property expresses an agreed Duty that must be fulfilled in case that a Prohibition has been violated by being exercised.

Has Right Operand
type: ObjectProperty
domain: Constraint
range: Class
  union of: Literal
  union of: anyURI
  union of: Right Operand
type: DatatypeProperty
type: NamedIndividual
type: Concept
definition: The value of the right operand in a constraint expression.
note: When used with set-based operators, a list of values may be used.

Target
type: ObjectProperty
sub property of: Relation
domain: Class
  union of: Policy
  union of: Rule
range: Asset
type: NamedIndividual
type: Concept
definition: The target property indicates the Asset that is the primary subject to which the Rule action directly applies.

Tracked Party
type: ObjectProperty
sub property of: Function
type: NamedIndividual
type: Concept
definition: The Party whose usage is being tracked.
note: May be specified as part of the acceptTracking action.
scope note: Non-Normative

Tracking Party
type: ObjectProperty
sub property of: Function
type: NamedIndividual
type: Concept
definition: The Party who is tracking usage.
note: May be specified as part of the acceptTracking action.
scope note: Non-Normative

Only One
type: ObjectProperty
sub property of: Operand
type: NamedIndividual
type: Concept
definition: The relation is satisfied when only one, and not more, of the Constaints is satisfied
note: This property MUST only be used for Logical Constraints, and the list of operand values MUST be Constraint instances.

interest
type: ObjectProperty
domain: E39 Actor
domain: Agent
range: Document
comment: A page about a topic of interest to this person.
term status: testing

description
type: ObjectProperty
domain: Thing
range: Class
  union of: Role
  union of: Text
  union of: TextObject
  union of: URL
comment: A description of the item.

nationality
type: ObjectProperty
domain: E39 Actor
domain: Person
range: Class
  union of: Country
  union of: Role
  union of: Text
  union of: URL
comment: Nationality of the person.

roleName
type: ObjectProperty
domain: E39 Actor
domain: Role
range: Class
  union of: Role
  union of: Text
  union of: URL
type: NamedIndividual
comment: A role played, performed or filled by a person or organization. For example, the team of creators for a comic book might fill the roles named 'inker', 'penciller', and 'letterer'; or an athlete in a SportsTeam might play in the position named 'Quarterback'.

specialty
type: ObjectProperty
domain: E39 Actor
domain: WebPage
range: Class
  union of: Role
  union of: Specialty
  union of: Text
  union of: URL
comment: One of the domain specialities to which this web page's content applies.

supersededBy
type: ObjectProperty
domain: Class
  union of: Class
  union of: Enumeration
  union of: Property
range: Class
  union of: Class
  union of: Enumeration
  union of: Property
  union of: Role
  union of: Text
  union of: URL
comment: Relates a term (i.e. a property, class or enumeration) to one that supersedes it.

P190 has symbolic content
type: DatatypeProperty
sub property of: P3 has note
domain: E90 Symbolic Object
comment: Quantification: many to many (0,n:0,n) Scope note: This property associates an instance of E90 Symbolic Object with a complete, identifying representation of its content in the form of an instance of E62 String. This property only applies to instances of E90 Symbolic Object that can be represented completely in this form. The representation may be more specific than the symbolic level defining the identity condition of the represented. This depends on the type of the symbolic object represented. For instance, if a name has type “Modern Greek character sequence”, it may be represented in a loss-free Latin transcription, meaning however the sequence of Greek letters. As another example, if the represented object has type “English words sequence”, American English or British English spelling variants may be chosen to represent the English word “colour” without defining a different symbolic object. If a name has type “European traditional name”, no particular string may define its content. Examples: - The materials description of the painting (E33) has symbolic content “Oil, French Watercolors on Paper, Graphite and Ink on Canvas, with an Oak frame.” (E62). - The title of Einstein’s 1915 text (E35) has symbolic content “Relativity, the Special and the General Theory” (E62). (Einstein, 2001) - The story of Little Red Riding Hood (E33) has symbolic content “Once upon a time there lived in a certain village.” (E62). (Lang, 1965) - The inscription on Rijksmuseum object SK-A-1601 (E34) has symbolic content “B” (E62). [reference: https://www.rijksmuseum.nl/en/collection/SK-A-1601/catalogue-entry (accessed 10(th) April 2021)] In First Order Logic: - P190(x,y) ⇒ E90(x) - P190(x,y) ⇒ E62(y)
label: P190 a pour contenu symbolique @fr
label: P190 имeeт символичeскоe содeржаниe @ru
notation: P190
preferred label: a pour contenu symbolique @fr
preferred label: has symbolic content
preferred label: имeeт символичeскоe содeржаниe @ru

P3 has note
type: DatatypeProperty
domain: E1 CRM Entity
comment: Quantification: one to many (0,n:0,1) Scope note: This property is a container for all informal descriptions about an object that have not been expressed in terms of CIDOC CRM constructs. In particular, it captures the characterisation of the item itself, its internal structures, appearance, etc. Like property P2 has type (is type of), this property is a consequence of the restricted focus of the CIDOC CRM. The aim is not to capture, in a structured form, everything that can be said about an item; indeed, the CIDOC CRM formalism is not regarded as sufficient to express everything that can be said. Good practice requires use of distinct note fields for different aspects of a characterisation. The P3.1 has type property of P3 has note allows differentiation of specific notes, e.g. “construction”, “decoration”, etc. An item may have many notes, but a note is attached to a specific item. Examples: - Coffee mug – OXCMS:1983.1.1 (E19) has note “chipped at edge of handle” (E62) has type Condition (E55). (fictitious) Properties: - P3.1 has type: E55 Type In First Order Logic: - P3(x,y) ⇒ E1(x) - P3(x,y) ⇒ E62(y) - P3(x,y,z) ⇒ [P3(x,y) ∧ E55(z)]
label: P3 a pour note @fr
label: P3 hat Anmerkung @de
label: P3 tem nota @pt
label: P3 έχει επεξήγηση @el
label: P3 имeeт примeчаниe @ru
label: P3 有注释 @zh
notation: P3
preferred label: a pour note @fr
preferred label: has note
preferred label: hat Anmerkung @de
preferred label: tem nota @pt
preferred label: έχει επεξήγηση @el
preferred label: имeeт примeчаниe @ru
preferred label: 有注释 @zh

P79 beginning is qualified by
type: DatatypeProperty
sub property of: P3 has note
domain: E52 Time-Span
comment: Quantification: many to one (0,1:0,n) Scope note: This property associates an instance of E52 Time-Span with a note detailing the scholarly or scientific opinions and justifications about the certainty, precision, sources etc. of its beginning. Such notes may also be used to elaborate arguments about constraints or to give explanations of alternatives. Examples: - The time-span of the Holocene (E52) beginning is qualified by “The formal definition and dating of the GSSP (GlobalStratotype Section and Point) for the base of the Holocene using the Greenland NGRIP ice core, and selected auxiliary records” (E62). (Walker et al., 2009) In First Order Logic: - P79(x,y) ⇒ E52(x) - P79(x,y) ⇒ E62(y) - P79(x,y) ⇒ P3(x,y)
label: P79 a son début qualifié par @fr
label: P79 hat Anfangsbegründung @de
label: P79 início é qualificado por @pt
label: P79 αρχή προσδιορίζεται από @el
label: P79 начало ограничeно @ru
label: P79 起始限定 @zh
notation: P79
preferred label: a son début qualifié par @fr
preferred label: beginning is qualified by
preferred label: hat Anfangsbegründung @de
preferred label: início é qualificado por @pt
preferred label: αρχή προσδιορίζεται από @el
preferred label: начало ограничeно @ru
preferred label: 起始限定 @zh

P80 end is qualified by
type: DatatypeProperty
sub property of: P3 has note
domain: E52 Time-Span
comment: Quantification: many to one (0,1:0,n) Scope note: This property associates an instance of E52 Time-Span with a note detailing the scholarly or scientific opinions and justifications about the end of this time-span concerning certainty, precision, sources etc. This property may also be used to describe arguments constraining possible dates and to distinguish reasons for alternative dates. Examples: - The time-span of the Holocene (E52) end is qualified by “still ongoing” (E62). (Walker et al., 2009) In First Order Logic: - P80(x,y) ⇒ E52(x) - P80(x,y) ⇒ E62(y) - P80(x,y) ⇒ P3(x,y)
label: P80 a sa fin qualifiée par @fr
label: P80 final é qualificado por @pt
label: P80 hat Begründung des Endes @de
label: P80 τέλος προσδιορίζεται από @el
label: P80 конeц ограничeн @ru
label: P80 结束限定 @zh
notation: P80
preferred label: a sa fin qualifiée par @fr
preferred label: end is qualified by
preferred label: final é qualificado por @pt
preferred label: hat Begründung des Endes @de
preferred label: τέλος προσδιορίζεται από @el
preferred label: конeц ограничeн @ru
preferred label: 结束限定 @zh

P90 has value
type: DatatypeProperty
domain: E54 Dimension
comment: Quantification: many to one, necessary (1,1:0,n) Scope note: This property allows an instance of E54 Dimension to be approximated by an instance of E60 Number primitive. Examples: - The height of silver cup 232 (E54) has value 226 (E60). (fictitious) - Christie’s hammer price for Vincent van Gogh’s “Still Life: Vase with Fifteen Sunflowers” in London on 30(th) March 1987 (E97) has value 24,750,000 (E60). In First Order Logic: - P90(x,y) ⇒ E54(x) - P90(x,y) ⇒ E60(y)
label: P90 a pour valeur @fr
label: P90 hat Wert @de
label: P90 tem valor @pt
label: P90 έχει τιμή @el
label: P90 имeeт значeниe @ru
label: P90 有数值 @zh
notation: P90
preferred label: a pour valeur @fr
preferred label: has value
preferred label: hat Wert @de
preferred label: tem valor @pt
preferred label: έχει τιμή @el
preferred label: имeeт значeниe @ru
preferred label: 有数值 @zh

User
type: Class
subclass of: E39 Actor
contributor: https://orcid.org/0000-0002-0905-7033
date: 2024-11-13T16:18:33Z
comment: Scope note: This class comprises agents, whether human individuals, groups, or non-human entities such as software applications, algorithms, or automated processes, that interact with digital systems or services by initiating actions, consuming resources, or producing outputs. Users are characterized by their capacity to perform intentional actions within a digital environment, for which they can be held responsible.​ Unlike E21 Person, which is limited to real or assumed human individuals, the class User encompasses a broader range of agents, including non-human actors that operate autonomously or semi-autonomously within digital contexts. This includes, but is not limited to, artificial intelligence models, automated scripts, and other algorithmic entities that engage with web services or digital platforms.​ The classification of an entity as a User does not necessitate legal personhood or consciousness; rather, it is based on the entity's functional role in interacting with digital systems in a manner that can be documented and attributed.​ Examples: - A registered individual accessing an online museum catalog.​ - An AI-driven recommendation engine suggesting artifacts to users.​ - A software bot performing automated data curation tasks.​
definition: rdfs:comment "Scope note: This class comprises agents, whether human individuals, groups, or non-human entities such as software applications, algorithms, or automated processes, that interact with digital systems or services by initiating actions, consuming resources, or producing outputs. Users are characterized by their capacity to perform intentional actions within a digital environment, for which they can be held responsible.​ Unlike E21 Person, which is limited to real or assumed human individuals, the class User encompasses a broader range of agents, including non-human actors that operate autonomously or semi-autonomously within digital contexts. This includes, but is not limited to, artificial intelligence models, automated scripts, and other algorithmic entities that engage with web services or digital platforms.​ The classification of an entity as a User does not necessitate legal personhood or consciousness; rather, it is based on the entity's functional role in interacting with digital systems in a manner that can be documented and attributed.​ Examples: - A registered individual accessing an online museum catalog.​ - An AI-driven recommendation engine suggesting artifacts to users.​ - A software bot performing automated data curation tasks.​"@en

Digital Artefact
type: Class
subclass of: E73 Information Object
contributor: https://orcid.org/0000-0002-0905-7033
date: 2024-11-13T16:20:05Z
comment: Scope note: This class comprises identifiable immaterial items, such as digital images, texts, multimedia objects, computer program code, algorithms, or mathematical formulae, that are created, modified, or stored in digital formats. Digital Artefacts have an objectively recognizable structure and are documented as single units. They exist independently of specific physical carriers and can reside on multiple digital mediums simultaneously. While E73 Information Objects encompass a broad range of immaterial items, including those stored in human memory or on physical media, Digital Artefacts are specifically associated with digital technologies. This subclassification aids in distinguishing between general information entities and those uniquely tied to digital environments.​ Examples: - A digital photograph of an ancient manuscript.​ - A 3D model of an archaeological excavation site.​ - The source code of a software application developed to catalog museum collections.​ - A dataset containing measurements of physical artefacts.
definition: rdfs:comment "Scope note: This class comprises identifiable immaterial items, such as digital images, texts, multimedia objects, computer program code, algorithms, or mathematical formulae, that are created, modified, or stored in digital formats. Digital Artefacts have an objectively recognizable structure and are documented as single units. They exist independently of specific physical carriers and can reside on multiple digital mediums simultaneously. While E73 Information Objects encompass a broad range of immaterial items, including those stored in human memory or on physical media, Digital Artefacts are specifically associated with digital technologies. This subclassification aids in distinguishing between general information entities and those uniquely tied to digital environments.​ Examples: - A digital photograph of an ancient manuscript.​ - A 3D model of an archaeological excavation site.​ - The source code of a software application developed to catalog museum collections.​ - A dataset containing measurements of physical artefacts."@en

Historical Event
type: Class
subclass of: E5 Event
contributor: https://orcid.org/0000-0002-0905-7033
date: 2024-11-19T12:02:07Z
definition: A specialized version of E5_Event, where we only refer to events with historical value. Historical value reflects the role that the heritage item has played in a broader historical narrative, offering insights into cultural, political, social, or technological contexts of specific periods.

Social movement
type: Class
subclass of: E55 Type
contributor: https://orcid.org/0000-0002-0905-7033
date: 2024-11-19T12:50:33Z
description: From wikidata (Q49773): loosely organized effort by a large group of people to achieve a particular set of goals
comment: From wikidata (Q49773): loosely organized effort by a large group of people to achieve a particular set of goals Scope note: A Social Movement is a loosely organized effort by a large group of people to achieve a particular set of goals, typically aiming to promote or resist changes in society's structure or values. These movements are characterized by collective action, where individuals unite based on shared beliefs or objectives, often seeking social, political, economic, or cultural transformations. ​ Social movements differ from formal organizations in that they may lack a defined organizational structure or formal membership, relying instead on informal networks and shared commitments. They can vary widely in size and scope, ranging from localized grassroots initiatives to large-scale national or international campaigns. The methods employed can include protests, demonstrations, advocacy, and other forms of collective action aimed at influencing public opinion and policy. ​ Examples: - The Civil Rights Movement in the United States, - The Environmental Movement - The Feminist Movement, - The LGBTQ+ Rights Movement
definition: rdfs:comment "From wikidata (Q49773): loosely organized effort by a large group of people to achieve a particular set of goals Scope note: A Social Movement is a loosely organized effort by a large group of people to achieve a particular set of goals, typically aiming to promote or resist changes in society's structure or values. These movements are characterized by collective action, where individuals unite based on shared beliefs or objectives, often seeking social, political, economic, or cultural transformations. ​ Social movements differ from formal organizations in that they may lack a defined organizational structure or formal membership, relying instead on informal networks and shared commitments. They can vary widely in size and scope, ranging from localized grassroots initiatives to large-scale national or international campaigns. The methods employed can include protests, demonstrations, advocacy, and other forms of collective action aimed at influencing public opinion and policy. ​ Examples: - The Civil Rights Movement in the United States, - The Environmental Movement - The Feminist Movement, - The LGBTQ+ Rights Movement"@en

Religious movement
type: Class
subclass of: Social movement
contributor: https://orcid.org/0000-0002-0905-7033
date: 2024-11-19T12:51:24Z
description: Wikidata: Q1826286, social and ideological movement in the religious sphere
comment: Wikidata: Q1826286, social and ideological movement in the religious sphere Scope note: A Religious Movement is a collective effort by a group of people aiming to promote, reform, or resist changes within religious beliefs, practices, or institutions. Examples: - The Protestant Reformation in the 16th century, which led to significant changes in Christian practices and beliefs.​ - The Charismatic Movement, emphasizing direct personal experience of God through baptism with the Holy Spirit.​ - The New Age Movement, a broad range of spiritual or religious beliefs and practices that developed in the Western world during the 1970s.
definition: rdfs:comment "Wikidata: Q1826286, social and ideological movement in the religious sphere Scope note: A Religious Movement is a collective effort by a group of people aiming to promote, reform, or resist changes within religious beliefs, practices, or institutions. Examples: - The Protestant Reformation in the 16th century, which led to significant changes in Christian practices and beliefs.​ - The Charismatic Movement, emphasizing direct personal experience of God through baptism with the Holy Spirit.​ - The New Age Movement, a broad range of spiritual or religious beliefs and practices that developed in the Western world during the 1970s."@en

Cultural movement
type: Class
subclass of: Social movement
contributor: https://orcid.org/0000-0002-0905-7033
date: 2024-11-19T12:51:32Z
description: Wikidata: Q2198855, period and movement in cultural history
comment: Wikidata: Q2198855, period and movement in cultural history Scope note: A Cultural Movement is a collective effort by loosely affiliated individuals aiming to transform societal perspectives through the dissemination of ideas via various art forms and intentional lifestyle choices. These movements often overlap with social and political movements, making them integral to broader cultural transformations. ​ Examples: - The Renaissance - The Romanticism movement - The Alté Movement in Nigeria
definition: rdfs:comment "Wikidata: Q2198855, period and movement in cultural history Scope note: A Cultural Movement is a collective effort by loosely affiliated individuals aiming to transform societal perspectives through the dissemination of ideas via various art forms and intentional lifestyle choices. These movements often overlap with social and political movements, making them integral to broader cultural transformations. ​ Examples: - The Renaissance - The Romanticism movement - The Alté Movement in Nigeria"@en

Political movement
type: Class
subclass of: Social movement
contributor: https://orcid.org/0000-0002-0905-7033
date: 2024-11-19T12:51:42Z
description: Wikidata: Q2738074, movement to obtain a political goal
comment: Wikidata: Q2738074, movement to obtain a political goal Scope note: A Political Movement is a collective effort by a group of people aiming to influence government policy, social values, or achieve specific political objectives. These movements are typically organized around particular issues or ideologies and seek to bring about change within the political system. They differ from political parties, which aim to gain political office, by focusing on specific goals rather than seeking electoral power. ​ Examples: - The Anti-Apartheid Movement, which campaigned against the system of racial segregation in South Africa.​ - The Tea Party Movement in the United States, advocating for reduced government spending and taxation.​ - The Brexit Movement, which sought the United Kingdom's withdrawal from the European Union.
definition: rdfs:comment "Wikidata: Q2738074, movement to obtain a political goal Scope note: A Political Movement is a collective effort by a group of people aiming to influence government policy, social values, or achieve specific political objectives. These movements are typically organized around particular issues or ideologies and seek to bring about change within the political system. They differ from political parties, which aim to gain political office, by focusing on specific goals rather than seeking electoral power. ​ Examples: - The Anti-Apartheid Movement, which campaigned against the system of racial segregation in South Africa.​ - The Tea Party Movement in the United States, advocating for reduced government spending and taxation.​ - The Brexit Movement, which sought the United Kingdom's withdrawal from the European Union."

Domain
type: Class
subclass of: E55 Type
contributor: https://orcid.org/0000-0002-0905-7033
date: 2024-12-06T13:27:25Z
comment: Scope note: This class comprises categories or fields of specialized knowledge, disciplines, or areas of expertise that are used to classify and contextualize instances of CIDOC CRM classes. Instances of Domain represent specific spheres of human thought or activity, providing a framework for understanding the context, provenance, or thematic classification of cultural heritage information.​ The Domain class serves as a means to associate cultural heritage entities with particular areas of study or professional practice, facilitating interdisciplinary research and knowledge organization. For example, associating an artifact with the domain of "archaeology" or "art history" helps in understanding its scholarly context and the methodologies applied to its study.​ Examples: - Archaeology​ - Art History​ - Ethnomusicology​ - Conservation Science
definition: rdfs:comment "Scope note: This class comprises categories or fields of specialized knowledge, disciplines, or areas of expertise that are used to classify and contextualize instances of CIDOC CRM classes. Instances of Domain represent specific spheres of human thought or activity, providing a framework for understanding the context, provenance, or thematic classification of cultural heritage information.​ The Domain class serves as a means to associate cultural heritage entities with particular areas of study or professional practice, facilitating interdisciplinary research and knowledge organization. For example, associating an artifact with the domain of \"archaeology\" or \"art history\" helps in understanding its scholarly context and the methodologies applied to its study.​ Examples: - Archaeology​ - Art History​ - Ethnomusicology​ - Conservation Science"@en

Economic Relevance
type: Class
subclass of: E55 Type
contributor: https://orcid.org/0000-0002-0905-7033
date: 2024-12-06T13:30:25Z
comment: Scope note: Economic Relevance pertains to concepts that define the economic significance or impact of entities, events, or activities. This class encompasses terms and categories used to classify and assess the economic aspects of cultural heritage items, historical events, or societal practices. Examples: - The economic impact of the Silk Road trade routes on participating civilizations.​ - The assessment of a museum's collection in terms of its monetary value and contribution to tourism revenue.​ - Analysis of the financial significance of a historical event, such as the Industrial Revolution, on global markets.
definition: rdfs:comment "Scope note: This class comprises categories or fields of specialized knowledge, disciplines, or areas of expertise that are used to classify and contextualize instances of CIDOC CRM classes. Instances of Domain represent specific spheres of human thought or activity, providing a framework for understanding the context, provenance, or thematic classification of cultural heritage information.​ The Domain class serves as a means to associate cultural heritage entities with particular areas of study or professional practice, facilitating interdisciplinary research and knowledge organization. For example, associating an artifact with the domain of \"archaeology\" or \"art history\" helps in understanding its scholarly context and the methodologies applied to its study.​ Examples: - Archaeology​ - Art History​ - Ethnomusicology​ - Conservation Science"@en

Symbolism
type: Class
subclass of: E55 Type
contributor: https://orcid.org/0000-0002-0905-7033
date: 2024-12-06T13:43:53Z
definition: Scope note: This class comprises the concepts, ideas, or qualities that an object, character, or event represents. Symbolism provides a deeper, often abstract, meaning that transcends the literal interpretation of an entity, reflecting cultural, religious, or historical contexts. It serves to connect a physical or conceptual entity to a broader narrative or ideology. Examples: - A dove representing peace. - The lion as a symbol of courage and royalty. - A skull symbolizing death and mortality (memento mori).

Building
type: Class
subclass of: Structures
creator: https://orcid.org/0000-0002-0905-7033
date: 2025-06-06T13:38:37Z
definition: Scope note: This class comprises man-made structures with a roof and walls, created to stand more or less permanently in one place. It serves as a superclass for more specific types of structures defined by their function or form, such as religious, residential, or ceremonial buildings.

Museum
type: Class
subclass of: E74 Group
contributor: https://orcid.org/0000-0002-0905-7033
date: 2025-04-11T08:31:05Z
comment: Scope note: This class comprises organizations that are established to collect, preserve, research, interpret, and exhibit tangible and intangible cultural heritage for the purposes of education, study, and enjoyment. Museums operate as collective entities, often encompassing various departments and professionals, and may be public or private institutions.​ As instances of E74 Group, museums are characterized by their organizational structure and collective actions aimed at the stewardship of cultural artifacts and information. They may also engage in activities such as publishing, educational programming, and community outreach.​ Museums can vary widely in scope and specialization, including but not limited to art museums, history museums, science museums, and ethnographic museums. Their defining feature is the systematic curation and presentation of collections to the public or specific audiences.​ Examples: - The British Museum​ - The Louvre​ - The Metropolitan Museum of Art​ - The National Museum of Denmark
definition: rdfs:comment "Scope note: This class comprises organizations that are established to collect, preserve, research, interpret, and exhibit tangible and intangible cultural heritage for the purposes of education, study, and enjoyment. Museums operate as collective entities, often encompassing various departments and professionals, and may be public or private institutions.​ As instances of E74 Group, museums are characterized by their organizational structure and collective actions aimed at the stewardship of cultural artifacts and information. They may also engage in activities such as publishing, educational programming, and community outreach.​ Museums can vary widely in scope and specialization, including but not limited to art museums, history museums, science museums, and ethnographic museums. Their defining feature is the systematic curation and presentation of collections to the public or specific audiences.​ Examples: - The British Museum​ - The Louvre​ - The Metropolitan Museum of Art​ - The National Museum of Denmark"@en

Religious Buildings
type: Class
subclass of: Building
creator: https://orcid.org/0000-0002-0905-7033
date: 2025-06-06T13:45:29Z
definition: Scope note: This class comprises structures designed and utilized for religious or spiritual activities, including worship, ceremony, and contemplation. These buildings are often characterized by specific architectural forms and iconographic elements that reflect the beliefs and practices of a particular faith or denomination.

Artist
type: Class
subclass of: E21 Person
contributor: https://orcid.org/0000-0002-0905-7033
date: 2025-04-11T08:32:18Z
comment: Scope note: This class comprises persons who are recognized for engaging in the creation or performance of works in the visual, performing, literary, or applied arts. This includes, but is not limited to, painters, sculptors, musicians, composers, writers, poets, actors, dancers, designers, and multimedia artists. An individual is regarded as an instance of Artist when there exists documented evidence of their engagement in artistic practices or when they are attributed with the authorship, performance, or conceptualization of artistic works, either by themselves or by third parties (such as curators, critics, or historical sources). Artists may be associated with specific cultural movements, artistic periods, or creative practices. The classification of a Person as an Artist does not require professional status or formal recognition; amateur and self-taught individuals are also included when their artistic activity is documented and contextually significant. In bibliographic or curatorial contexts, attribution of a creative work to an individual is sufficient to regard them as an Artist, even if the attribution is anonymous, pseudonymous, or contested. Examples: - Leonardo da Vinci - Frida Kahlo - William Shakespeare - Maya Deren

Physical Artefact
type: Class
subclass of: E22 Human-Made Object
contributor: https://orcid.org/0000-0002-0905-7033
date: 2025-04-11T08:35:55Z
comment: Scope note: This class comprises all persistent physical objects of any size that are purposely created by human activity and have physical boundaries that separate them completely in an objective way from other objects. The class also includes all aggregates of objects made for functional purposes of whatever kind, independent of physical coherence, such as a set of chessmen.​ Physical Artefacts are distinguished by their tangible nature and intentional creation, serving various purposes such as utility, artistic expression, or cultural significance. They may range from individual items like tools and artworks to assembled collections designed to function as a whole.​ Examples: - The Rosetta Stone - LNER Class A4 4468 Mallard [the World’s fastest steam locomotive, preserved at the National Railway Museum of York, UK] - The Portland Vase

Artwork
type: Class
subclass of: Physical Artefact
contributor: https://orcid.org/0000-0002-0905-7033
date: 2025-04-11T08:37:01Z
comment: Scope note: This class comprises physical artefacts that are primarily created as expressions of aesthetic, conceptual, or symbolic intent. Artworks encompass a wide range of tangible objects produced through artistic practices, including but not limited to paintings, sculptures, installations, and mixed-media pieces.​ Artworks are distinguished by their purpose of conveying artistic expression, emotion, or commentary, rather than serving utilitarian functions. They are often characterized by their unique form, style, and the creative processes involved in their production.​ While all artworks are physical artefacts, not all physical artefacts qualify as artworks; the classification depends on the creator's intent and the cultural context attributing artistic value to the object.​ CIDOC CRM Examples: - The Mona Lisa by Leonardo da Vinci​ - The Thinker by Auguste Rodin​ - The Starry Night by Vincent van Gogh​ - Balloon Dog (Red) by Jeff Koons

Instrument
type: Class
subclass of: Physical Artefact
contributor: https://orcid.org/0000-0002-0905-7033
date: 2025-04-11T08:37:08Z
comment: Scope note: This class comprises physical artefacts that are intentionally created and utilized by humans to produce, modify, or measure sound, music, or other forms of audio. Instruments are designed with specific acoustic properties or mechanisms to facilitate the creation or manipulation of auditory phenomena. This includes, but is not limited to, musical instruments such as string, wind, percussion, and electronic instruments.​ Instruments are characterized by their functional design aimed at generating or controlling sound, distinguishing them from other physical artefacts. They may vary in complexity from simple objects like drums and flutes to intricate devices like synthesizers and orchestral instruments.​ Examples: - A Stradivarius violin​ - A Steinway grand piano​ - A traditional African djembe drum​ - A Moog synthesizer

Genre
type: Class
subclass of: E55 Type
contributor: https://orcid.org/0000-0002-0905-7033
date: 2025-04-11T11:18:31Z
comment: Scope note: The Genre class encompasses concepts that denote specific categories or styles of creative works, including but not limited to:​ - Music Genres: Such as classical, jazz, rock, or electronic.​ - Film Genres: Including drama, comedy, thriller, or documentary.​ - Artistic Genres: Like impressionism, surrealism, or abstract expressionism.​ - Literary Genres: Such as fiction, non-fiction, poetry, or drama.​ Instances of the Genre class provide a means to classify and contextualize creative works within their respective domains, enhancing the discovery and analysis of cultural heritage materials based on their genre-specific characteristics.​ Examples: - Jazz (music genre)​ - Film Noir (film genre)​ - Renaissance Art (artistic genre)​ - Science Fiction (literary genre)
definition: rdfs:comment "Scope note: The Genre class encompasses concepts that denote specific categories or styles of creative works, including but not limited to:​ - Music Genres: Such as classical, jazz, rock, or electronic.​ - Film Genres: Including drama, comedy, thriller, or documentary.​ - Artistic Genres: Like impressionism, surrealism, or abstract expressionism.​ - Literary Genres: Such as fiction, non-fiction, poetry, or drama.​ Instances of the Genre class provide a means to classify and contextualize creative works within their respective domains, enhancing the discovery and analysis of cultural heritage materials based on their genre-specific characteristics.​ Examples: - Jazz (music genre)​ - Film Noir (film genre)​ - Renaissance Art (artistic genre)​ - Science Fiction (literary genre)"@en

Field Of Work
type: Class
subclass of: E55 Type
contributor: https://orcid.org/0000-0002-0905-7033
date: 2025-04-11T11:18:41Z
comment: Scope note: This class comprises concepts that denote areas of professional, academic, or creative activity in which individuals, groups, or organizations engage. Instances of Field of Work represent specific domains of expertise or practice, such as "architecture," "literature," or "engineering," and are used to classify and contextualize the roles, contributions, or affiliations of persons within the CIDOC CRM framework.​ By associating persons with a Field of Work, one can provide semantic context regarding the nature of their activities or specializations. Examples: - Architecture​ - Literature​ - Engineering​ - Performing Arts​
definition: rdfs:comment "Scope note: This class comprises concepts that denote areas of professional, academic, or creative activity in which individuals, groups, or organizations engage. Instances of Field of Work represent specific domains of expertise or practice, such as \"architecture,\" \"literature,\" or \"engineering,\" and are used to classify and contextualize the roles, contributions, or affiliations of persons within the CIDOC CRM framework.​ By associating persons with a Field of Work, one can provide semantic context regarding the nature of their activities or specializations. Examples: - Architecture​ - Literature​ - Engineering​ - Performing Arts​"@en

Churches
type: Class
subclass of: Religious Buildings
creator: https://orcid.org/0000-0002-0905-7033
date: 2025-06-06T13:45:45Z
definition: Scope note: This class comprises buildings specifically designed and used for public Christian worship, prayer, and ceremony. The architectural form and features of a church are often symbolic of Christian beliefs and liturgical practices.

Movement
type: Class
subclass of: E55 Type
contributor: https://orcid.org/0000-0002-0905-7033
date: 2025-04-12T09:17:34Z
comment: Scope note: This class comprises concepts that denote distinct movements or scenes in the realms of literature, art, science, or philosophy. It is used to classify and contextualize creative and intellectual currents by grouping together works or individuals according to shared aesthetics, ideologies, methodologies, or historical trends. Examples: - Impressionism - Romanticism - Modernism - Existentialism
definition: rdfs:comment "Scope note: This class comprises concepts that denote distinct movements or scenes in the realms of literature, art, science, or philosophy. It is used to classify and contextualize creative and intellectual currents by grouping together works or individuals according to shared aesthetics, ideologies, methodologies, or historical trends. Examples: - Impressionism - Romanticism - Modernism - Existentialism"@en

Basilicas
type: Class
subclass of: Churches
creator: https://orcid.org/0000-0002-0905-7033
date: 2025-06-06T13:46:10Z
definition: Scope note: This class comprises churches that have been granted special privileges by the Pope due to their historical, spiritual, or architectural significance. In architectural terms, it can also refer to a building style characterized by a rectangular plan with a central nave and aisles, and an apse at one or both ends.

Cathedrals
type: Class
subclass of: Churches
creator: https://orcid.org/0000-0002-0905-7033
date: 2025-06-06T13:46:32Z
definition: This class comprises the principal church of a diocese, containing the bishop's official throne (cathedra). Cathedrals serve as the central church of a region and are often among the most architecturally significant and historically important buildings in their area.

Chapels
type: Class
subclass of: Religious Buildings
creator: https://orcid.org/0000-0002-0905-7033
date: 2025-06-06T13:47:51Z
definition: Scope note: This class comprises small places of Christian worship, which may be part of a larger institution (like a cathedral, palace, or hospital), or can be a standalone building. They are often intended for private prayer or smaller services.

Temples
type: Class
subclass of: Religious Buildings
creator: https://orcid.org/0000-0002-0905-7033
date: 2025-06-06T13:48:27Z
definition: Scope note: This class comprises buildings reserved for religious or spiritual rituals and activities such as prayer and sacrifice. It is a term used for houses of worship in many different religions.

Domus Ecclesiae
type: Class
subclass of: Religious Buildings
creator: https://orcid.org/0000-0002-0905-7033
date: 2025-06-06T13:48:42Z
definition: Scope note: This class comprises private buildings adapted for Christian worship. These "house churches" were the earliest places of public worship for the Christian community, often established within existing residential structures.

Mosques
type: Class
subclass of: Religious Buildings
creator: https://orcid.org/0000-0002-0905-7033
date: 2025-06-06T13:49:10Z
definition: Scope note: This class comprises buildings that serve as places of worship for Muslims. Mosques are characterized by specific features such as a mihrab (prayer niche indicating the direction of Mecca) and a minbar (pulpit).

Structures
type: Class
subclass of: Physical Artefact
creator: https://orcid.org/0000-0002-0905-7033
date: 2025-06-06T13:50:08Z
definition: Scope note: This class comprises man-made objects that are constructed or organized in a particular way, often on a large scale. This class is a superclass for buildings and other constructed entities that may not be fully enclosed.

Mosaics
type: Class
subclass of: Artwork
creator: https://orcid.org/0000-0002-0905-7033
date: 2025-06-06T13:52:27Z
definition: Scope note: This class comprises artworks created by assembling small pieces of material, such as stone, glass, or ceramic, known as tesserae. These pieces are set into an adhesive surface, such as plaster or mortar, to form an image or pattern. Mosaics are typically used to decorate floors, walls, or ceilings.

Open Spaces
type: Class
subclass of: Physical Artefact
creator: https://orcid.org/0000-0002-0905-7033
date: 2025-06-06T13:54:47Z
definition: Scope note: This class comprises unenclosed areas within a built environment that are designed for public use, gathering, or passage. These spaces are defined by the architectural and landscape elements that surround them.

Forums
type: Class
subclass of: Open Spaces
creator: https://orcid.org/0000-0002-0905-7033
date: 2025-06-06T13:54:51Z
definition: Scope note: This class comprises public squares or marketplaces in ancient Roman cities, which served as the center for judicial, civic, and commercial activities. They were typically surrounded by public buildings and colonnades.

Residential Buildings
type: Class
subclass of: Building
creator: https://orcid.org/0000-0002-0905-7033
date: 2025-06-06T13:55:50Z
definition: Scope note: This class comprises buildings designed and used for human habitation. It encompasses various forms of domestic architecture, from single-family homes to larger, more complex dwellings.

Houses
type: Class
subclass of: Residential Buildings
creator: https://orcid.org/0000-0002-0905-7033
date: 2025-06-06T13:56:01Z
definition: Scope note: This class comprises buildings designed as a dwelling for a single family or a small group of individuals. It is a fundamental unit of residential architecture.

Villas
type: Class
subclass of: Houses
creator: https://orcid.org/0000-0002-0905-7033
date: 2025-06-06T13:56:22Z
definition: Scope note: This class comprises large, luxurious country houses with substantial grounds. Originally referring to large Roman country estates, the term is now used for significant rural or suburban residences.

Domus
type: Class
subclass of: Houses
creator: https://orcid.org/0000-0002-0905-7033
date: 2025-06-06T13:56:56Z
definition: Scope note: This class comprises a type of house occupied by the upper classes and some wealthy freedmen during the Roman Republic and Empire.

Complexes
type: Class
subclass of: Physical Artefact
creator: https://orcid.org/0000-0002-0905-7033
date: 2025-06-06T13:58:09Z
definition: Scope note: This class comprises groups of interrelated buildings and structures that are designed to function as a single, integrated unit. These can be defined by a common purpose, architectural style, or historical period.

Cemeteries
type: Class
subclass of: Complexes
creator: https://orcid.org/0000-0002-0905-7033
date: 2025-06-06T13:58:22Z
definition: Scope note: This class comprises designated areas where the remains of deceased people are buried or otherwise interred. They are characterized by the presence of graves, tombs, or other forms of funerary monuments.

Necropolis
type: Class
subclass of: Cemeteries
creator: https://orcid.org/0000-0002-0905-7033
date: 2025-06-06T13:58:31Z
definition: Scope note: This class comprises large, designed cemeteries or burial sites from ancient civilizations. The term literally means "city of the dead," and these sites often feature elaborate tomb structures.

Ceremonial Buildings
type: Class
subclass of: Building
creator: https://orcid.org/0000-0002-0905-7033
date: 2025-06-06T14:02:06Z
definition: Scope note: This class comprises buildings designed primarily for holding rites, ceremonies, or formal public events. Their function may be religious, civic, or commemorative in nature.

Tombs
type: Class
subclass of: Ceremonial Buildings
creator: https://orcid.org/0000-0002-0905-7033
date: 2025-06-06T14:02:13Z
definition: Scope note: This class comprises structures or chambers used for the burial or interment of the dead. Tombs can range from simple graves to elaborate mausoleums and pyramids.

Painting
type: Class
subclass of: Artwork
creator: https://orcid.org/0000-0002-0905-7033
date: 2025-06-06T14:10:26Z
definition: Scope note: This class comprises artworks created by applying paint, pigment, color or other medium to a solid surface (called the "matrix" or "support") such as a canvas, wall, or panel. The medium is commonly applied to the base with a brush, but other implements, such as knives, sponges, and airbrushes, can be used.

Clothing
type: Class
subclass of: Physical Artefact
creator: https://orcid.org/0000-0002-0905-7033
date: 2025-06-06T16:01:48Z
definition: Scope note: This class comprises items worn on the body. Typically, clothing is made of fabrics or textiles, but over time it has included garments made from animal skin and other thin sheets of materials and natural products found in the environment, put together.

Main Garments
type: Class
subclass of: Clothing
creator: https://orcid.org/0000-0002-0905-7033
date: 2025-06-06T16:03:15Z
definition: Scope note: This class comprises the primary items of clothing that form the basis of an outfit, covering the torso and/or lower body.

Outerwear
type: Class
subclass of: Clothing
creator: https://orcid.org/0000-0002-0905-7033
date: 2025-06-06T16:03:22Z
definition: Scope note: This class comprises garments worn over other clothes, especially for warmth or protection when outdoors.

Underwear
type: Class
subclass of: Clothing
creator: https://orcid.org/0000-0002-0905-7033
date: 2025-06-06T16:03:30Z
definition: Scope note: This class comprises garments worn next to the skin, underneath other clothing.

Dresses
type: Class
subclass of: Main Garments
creator: https://orcid.org/0000-0002-0905-7033
date: 2025-06-06T16:03:44Z
definition: Scope note: This class comprises one-piece garments for a woman or girl that consist of a bodice and a skirt.

Coats
type: Class
subclass of: Main Garments
subclass of: Outerwear
creator: https://orcid.org/0000-0002-0905-7033
date: 2025-06-06T16:04:01Z
definition: Scope note: This class comprises outer garments with sleeves, worn outdoors over other clothes for warmth or protection.

Plaids
type: Class
subclass of: Main Garments
creator: https://orcid.org/0000-0002-0905-7033
date: 2025-06-06T16:04:29Z
definition: Scope note: This class comprises a piece of cloth, typically with a tartan pattern, worn as part of Scottish Highland dress. It is draped over the shoulder as an accessory or used as a blanket.

Robes
type: Class
subclass of: Main Garments
creator: https://orcid.org/0000-0002-0905-7033
date: 2025-06-06T16:04:34Z
definition: Scope note: This class comprises long, loose outer garments, often worn as a sign of office or for ceremonial occasions, or informally at home.

Suits
type: Class
subclass of: Main Garments
creator: https://orcid.org/0000-0002-0905-7033
date: 2025-06-06T16:04:39Z
definition: Scope note: This class comprises a set of outer clothes made of the same fabric and designed to be worn together, typically consisting of at least a jacket and trousers or a skirt.

Tunics
type: Class
subclass of: Main Garments
creator: https://orcid.org/0000-0002-0905-7033
date: 2025-06-06T16:04:46Z
definition: Scope note: This class comprises a simple garment, typically sleeveless or with short sleeves, that hangs from the shoulders to a length between the hips and the knees. It was a common garment in ancient Greece and Rome and remains a feature of some modern clothing styles.

Cloaks
type: Class
subclass of: Outerwear
creator: https://orcid.org/0000-0002-0905-7033
date: 2025-06-06T16:06:41Z
definition: Scope note: This class comprises sleeveless outdoor overgarments which drape from the shoulders. They are worn for warmth, protection, or as part of ceremonial or formal dress.

Chemises
type: Class
subclass of: Underwear
creator: https://orcid.org/0000-0002-0905-7033
date: 2025-06-06T16:08:29Z
definition: Scope note: This class comprises a simple, loose-fitting garment worn next to the skin, serving as a shirt or undergarment for both men and women in various historical periods. It protected outer garments from sweat and body oils.

Underpants
type: Class
subclass of: Underwear
creator: https://orcid.org/0000-0002-0905-7033
date: 2025-06-06T16:08:38Z
definition: Scope note: This class comprises undergarments worn on the lower part of the body.

Underdresses
type: Class
subclass of: Underwear
creator: https://orcid.org/0000-0002-0905-7033
date: 2025-06-06T16:08:46Z
definition: Scope note: This class comprises a simple dress-like garment worn underneath a more elaborate outer dress, either for warmth, to provide structure, or to protect the outer layer.

Lingerie
type: Class
subclass of: Underwear
creator: https://orcid.org/0000-0002-0905-7033
date: 2025-06-06T16:09:03Z
definition: Scope note: This class comprises women's underwear and nightclothes, often characterized by being lightweight, decorative, and made from fine materials.

Underskirts
type: Class
subclass of: Underwear
creator: https://orcid.org/0000-0002-0905-7033
date: 2025-06-06T16:09:13Z
definition: Scope note: This class comprises skirts worn underneath an outer skirt for warmth, modesty, or to give the outer skirt a desired shape and volume.

Documents
type: Class
subclass of: Physical Artefact
creator: https://orcid.org/0000-0002-0905-7033
date: 2025-06-06T16:16:03Z
definition: Scope note: This class comprises physical artefacts consisting of a piece of written, printed, or electronic matter that provides information or evidence or that serves as an official record.

Letters
type: Class
subclass of: Documents
creator: https://orcid.org/0000-0002-0905-7033
date: 2025-06-06T16:16:12Z
definition: Scope note: This class comprises written messages from one person or group to another, conveyed by a postal service or by hand. They are a form of personal or official communication recorded on a physical medium.

Medals
type: Class
subclass of: Artwork
subclass of: Awards
creator: https://orcid.org/0000-0002-0905-7033
date: 2025-06-06T16:18:13Z
definition: Scope note: This class comprises small, portable artistic objects, typically made of metal and circular in shape, issued to commemorate a person or event, or as an award for distinction.

Awards
type: Class
subclass of: Physical Artefact
creator: https://orcid.org/0000-0002-0905-7033
date: 2025-06-06T16:23:00Z
definition: Scope note: This class comprises tangible items given to a person or group in recognition of excellence in a certain field. They serve as a physical token of an honor or prize.

Cup
type: Class
subclass of: Awards
creator: https://orcid.org/0000-0002-0905-7033
date: 2025-06-06T16:23:05Z
definition: Scope note: This class comprises trophy cups, which are awards in the form of a drinking vessel, often made of precious metal and mounted on a base, given as a prize in a competition.

Image
type: Class
subclass of: Digital Artefact
subclass of: E36 Visual Item
creator: https://orcid.org/0000-0002-0905-7033
date: 2025-06-06T17:06:03Z
definition: Scope note: This class comprises digital artefacts that represent visual information, such as a photograph, drawing, or graphic. They are stored as a raster or vector file format.

3D Object
type: Class
subclass of: Digital Artefact
subclass of: E36 Visual Item
creator: https://orcid.org/0000-0002-0905-7033
date: 2025-06-06T17:06:09Z
definition: Scope note: This class comprises digital artefacts that represent a three-dimensional object using a collection of points in 3D space, connected by various geometric entities such as triangles, lines, and curved surfaces.

Video
type: Class
subclass of: Digital Artefact
subclass of: E36 Visual Item
creator: https://orcid.org/0000-0002-0905-7033
date: 2025-06-06T17:06:14Z
definition: Scope note: This class comprises digital artefacts consisting of a recording of moving visual images. It can include synchronized audio.

Audio
type: Class
subclass of: Digital Artefact
creator: https://orcid.org/0000-0002-0905-7033
date: 2025-06-06T17:06:18Z
definition: Scope note: This class comprises digital artefacts consisting of sound recordings. This includes music, spoken word, and other forms of auditory information stored in a digital format.

E13 Attribute Assignment
type: Class
subclass of: E7 Activity
comment: Scope note: This class comprises the actions of making assertions about one property of an object or any single relation between two items or concepts. The type of the property asserted to hold between two items or concepts can be described by the property P177 assigned property of type (is type of property assigned): E55 Type. For example, the class describes the actions of people making propositions and statements during certain scientific/scholarly procedures, e.g. the person and date when a condition statement was made, an identifier was assigned, the museum object was measured, etc. Which kinds of such assignments and statements need to be documented explicitly in structures of a schema rather than free text, depends on whether this information should be accessible by structured queries. This class allows for the documentation of how the respective assignment came about, and whose opinion it was. Note that all instances of properties described in a knowledge base are the opinion of someone. Per default, they are the opinion of the team maintaining the knowledge base. This fact must not individually be registered for all instances of properties provided by the maintaining team, because it would result in an endless recursion of whose opinion was the description of an opinion. Therefore, the use of instances of E13 Attribute Assignment marks the fact that the maintaining team is in general neutral to the validity of the respective assertion, but registers someone else’s opinion and how it came about. All properties assigned in such an action can also be seen as directly relating the respective pair of items or concepts. Multiple use of instances of E13 Attribute Assignment may possibly lead to a collection of contradictory values. Examples: - the examination of MS Sinai Greek 418 by Nicholas Pickwoad in November 2003 (Honey & Pickwoad, 2010) - the assessment of the current ownership of Martin Doerr’s silver cup in February 1997 (fictitious) In First Order Logic: …
label: E13 Assignation d’attribut @fr
label: E13 Atribuição de Característica @pt
label: E13 Merkmalszuweisung @de
label: E13 Απόδοση Ιδιοτήτων @el
label: E13 Назначeниe Атрибута @ru
label: E13 属性赋值 @zh
notation: E13
preferred label: Assignation d’attribut @fr
preferred label: Atribuição de Característica @pt
preferred label: Attribute Assignment
preferred label: Merkmalszuweisung @de
preferred label: Απόδοση Ιδιοτήτων @el
preferred label: Назначeниe Атрибута @ru
preferred label: 属性赋值 @zh

E16 Measurement
type: Class
subclass of: E13 Attribute Assignment
comment: Scope note: This class comprises actions measuring physical properties and other values that can be determined by a systematic, objective procedure of direct observation of particular states of physical reality. An instance of E16 Measurement may use simple counting or tools, such as yardsticks or radiation detection devices. The interest is in the method and care applied, so that the reliability of the result may be judged at a later stage, or research continued on the associated documents. The date of the event is important for dimensions, which may change value over time, such as the length of an object subject to shrinkage. Methods and devices employed should be associated with instances of E16 Measurement by properties such as P33 used specific technique: E29 Design or Procedure, P125 used object of type: E55 Type, P16 used specific object (was used for): E70 Thing, whereas basic techniques such as "carbon-14 dating" should be encoded using P2 has type (is type of): E55 Type. Details of methods and devices reused or reusable in other instances of E16 Measurement should be documented for these entities rather than the measurements themselves, whereas details of particular execution may be documented by free text or by instantiating adequate sub-activities, if the detail may be of interest for an overarching query. Regardless whether a measurement is made by an instrument or by human senses, it represents the initial transition from physical reality to information without any other documented information object in between within the reasoning chain that would represent the result of the interaction of the observer or device with reality. Therefore, determining properties of an instance of E90 Symbolic Object is regarded as an instance of E13 Attribute Assignment, which may be inferred from observing and measuring representative carriers. In the case that the carrier can be named, the property P16 used specific object (was used for) should be used to indicate the …
label: E16 Medição @pt
label: E16 Messung @de
label: E16 Mesurage @fr
label: E16 Μέτρηση @el
label: E16 Измeрeниe @ru
label: E16 测量 @zh
notation: E16
preferred label: Measurement
preferred label: Medição @pt
preferred label: Messung @de
preferred label: Mesurage @fr
preferred label: Μέτρηση @el
preferred label: Измeрeниe @ru
preferred label: 测量 @zh

E18 Physical Thing
type: Class
subclass of: E72 Legal Object
comment: Scope note: This class comprises all persistent physical items with a relatively stable form, human-made or natural. Depending on the existence of natural boundaries of such things, the CIDOC CRM distinguishes the instances of E19 Physical Object from instances of E26 Physical Feature, such as holes, rivers, pieces of land, etc. Most instances of E19 Physical Object can be moved (if not too heavy), whereas features are integral to the surrounding matter. An instance of E18 Physical Thing occupies not only a particular geometric space at any instant of its existence, but in the course of its existence it also forms a trajectory through spacetime, which occupies a real, that is phenomenal, volume in spacetime. We include in the occupied space the space filled by the matter of the physical thing and all its inner spaces, such as the interior of a box. For the purpose of more detailed descriptions of the presence of an instance of E18 Physical Thing in space and time it can be associated with its specific instance of E92 Spacetime Volume by the property P196 defines (is defined by). The CIDOC CRM is generally not concerned with amounts of matter in fluid or gaseous states, as long as they are not confined in an identifiable way for an identifiable minimal time-span. Examples: - the Cullinan Diamond (E19) (Scarratt and Shor, 2006) - the cave “Ideon Andron” in Crete (E26) (Smith, 1844-49) - the Mona Lisa (E22) (Mohen, 2006) In First Order Logic: - E18(x) ⇒ E72(x)
label: E18 Chose matérielle @fr
label: E18 Coisa Material @pt
label: E18 Materielles @de
label: E18 Υλικό Πράγμα @el
label: E18 Матeриальный Прeдмeт @ru
label: E18 实物 @zh
notation: E18
preferred label: Chose matérielle @fr
preferred label: Coisa Material @pt
preferred label: Materielles @de
preferred label: Physical Thing
preferred label: Υλικό Πράγμα @el
preferred label: Матeриальный Прeдмeт @ru
preferred label: 实物 @zh

E19 Physical Object
type: Class
subclass of: E18 Physical Thing
comment: Scope note: This class comprises items of a material nature that are units for documentation and have physical boundaries that separate them completely in an objective way from other objects. The class also includes all aggregates of objects made for functional purposes of whatever kind, independent of physical coherence, such as a set of chessmen. Typically, instances of E19 Physical Object can be moved (if not too heavy). In some contexts, such objects, except for aggregates, are also called “bona fide objects”, i.e. naturally defined objects (Smith & Varzi, 2000). The decision as to what is documented as a complete item, rather than by its parts or components, may be purely administrative or may be a result of the order in which the item was acquired. Examples: - Aphrodite of Milos (E22) (Kousser, 2005) - the Cullinan Diamond (Scarratt and Shor, 2006) - Apollo 13 at the time of launch (E22) (Lovell and Kluger, 1994) In First Order Logic: - E19(x) ⇒ E18(x)
label: E19 Materieller Gegenstand @de
label: E19 Objet matériel @fr
label: E19 Objeto Material @pt
label: E19 Υλικό Αντικείμενο @el
label: E19 Матeриальный Объeкт @ru
label: E19 物质对象 @zh
notation: E19
preferred label: Materieller Gegenstand @de
preferred label: Objet matériel @fr
preferred label: Objeto Material @pt
preferred label: Physical Object
preferred label: Υλικό Αντικείμενο @el
preferred label: Матeриальный Объeкт @ru
preferred label: 物质对象 @zh

E1 CRM Entity
type: Class
comment: Scope note: This class comprises all things in the universe of discourse of the CIDOC Conceptual Reference Model. It is an abstract concept providing for three general properties: - Identification by name or appellation, and in particular by a preferred identifier - Classification by type, allowing further refinement of the specific subclass to which an instance belongs - Attachment of free text and other unstructured data for the expression of anything not captured by formal properties All other classes within the CIDOC CRM are directly or indirectly specialisations of E1 CRM Entity. Examples: - the earthquake in Lisbon 1755 (E5) (Chester, 2001) In First Order Logic: - E1(x)
label: E1 CRM Entität @de
label: E1 CRM Сущность @ru
label: E1 CRM实体 @zh
label: E1 Entidade CRM @pt
label: E1 Entité CRM @fr
label: E1 Οντότητα CIDOC CRM @el
notation: E1
preferred label: CRM Entity
preferred label: CRM Entität @de
preferred label: CRM Сущность @ru
preferred label: CRM实体 @zh
preferred label: Entidade CRM @pt
preferred label: Entité CRM @fr
preferred label: Οντότητα CIDOC CRM @el

E20 Biological Object
type: Class
subclass of: E19 Physical Object
comment: Scope note: This class comprises individual items of a material nature, which live, have lived, or are natural products of or from living organisms. Artificial objects that incorporate biological elements, such as Victorian butterfly frames, can be documented as both instances of E20 Biological Object and E22 Human-Made Object. Examples: - me (fictitious) - Tut-Ankh-Amun (Edwards and Boltin, 1979) - Boukephalus [Horse of Alexander the Great] (Lamb, 2005) - petrified dinosaur excrement PA1906-344 In First Order Logic: - E20(x) ⇒ E19(x)
label: E20 Biologischer Gegenstand @de
label: E20 Objet biologique @fr
label: E20 Objeto Biológico @pt
label: E20 Βιολογικό Ακτικείμενο @el
label: E20 Биологичeский Объeкт @ru
label: E20 生物对象 @zh
notation: E20
preferred label: Biological Object
preferred label: Biologischer Gegenstand @de
preferred label: Objet biologique @fr
preferred label: Objeto Biológico @pt
preferred label: Βιολογικό Ακτικείμενο @el
preferred label: Биологичeский Объeкт @ru
preferred label: 生物对象 @zh

E21 Person
type: Class
subclass of: E20 Biological Object
subclass of: E39 Actor
comment: Scope note: This class comprises real persons who live or are assumed to have lived. Legendary figures that may have existed, such as Ulysses and King Arthur, fall into this class if the documentation refers to them as historical figures. In cases where doubt exists as to whether several persons are in fact identical, multiple instances can be created and linked to indicate their relationship. The CIDOC CRM does not propose a specific form to support reasoning about possible identity. In a bibliographic context, a name presented following the conventions usually employed for personal names will be assumed to correspond to an actual real person (an instance of E21 Person), unless evidence is available to indicate that this is not the case. The fact that a persona may erroneously be classified as an instance of E21 Person does not imply that the concept comprises personae. Examples: - Tut-Ankh-Amun (Edwards and Boltin, 1979) - Nelson Mandela (Brown and Hort, 2006) In First Order Logic: - E21(x) ⇒ E20(x) - E21(x) ⇒ E39(x)
label: E21 Personne @fr
label: E21 Pessoa @pt
label: E21 Πρόσωπο @el
label: E21 Личность @ru
label: E21 人物 @zh
notation: E21
preferred label: Person
preferred label: Personne @fr
preferred label: Pessoa @pt
preferred label: Πρόσωπο @el
preferred label: Личность @ru
preferred label: 人物 @zh

E22 Human-Made Object
type: Class
subclass of: E19 Physical Object
subclass of: E24 Physical Human-Made Thing
comment: Scope note: This class comprises all persistent physical objects of any size that are purposely created by human activity and have physical boundaries that separate them completely in an objective way from other objects. The class also includes all aggregates of objects made for functional purposes of whatever kind, independent of physical coherence, such as a set of chessmen. Examples: - the Rosetta Stone (E22) - LNER Class A4 4468 Mallard [the World’s fastest steam locomotive, preserved at the National Railway Museum of York, UK] (Solomon, 2003) - the Portland Vase (Walker, 2004) In First Order Logic: - E22(x) ⇒ E19(x) - E22(x) ⇒ E24(x)
label: E22 Objet élaboré par l’humain @fr
label: E22 Рукотворный Объeкт @ru
notation: E22
preferred label: Human-Made Object
preferred label: Objet élaboré par l’humain @fr
preferred label: Рукотворный Объeкт @ru

E24 Physical Human-Made Thing
type: Class
subclass of: E18 Physical Thing
subclass of: E71 Human-Made Thing
comment: Scope note: This class comprises all persistent physical items of any size that are purposely created by human activity. This class comprises, besides others, human-made objects, such as a sword, and human-made features, such as rock art. For example, a “cup and ring” carving on bedrock is regarded as instance of E24 Physical Human-Made Thing. Instances of E24 Physical Human-Made Thing may be the result of modifying pre-existing physical things, preserving larger parts or most of the original matter and structure, which poses the question if they are new or even human-made, the respective interventions of production made on such original material should be obvious and sufficient to regard that the product has a new, distinct identity and intended function and is human-made. Substantial continuity of the previous matter and structure in the new product can be documented by describing the production process also as an instance of E81 Transformation. Whereas interventions of conservation and repair are not regarded to produce a new instance of E24 Physical Human-Made Thing, the results of preparation of natural history specimens that substantially change their natural or original state should be regarded as instances of E24 Physical Human-Made Things, including the uncovering of petrified biological features from a solid piece of stone. On the other side, scribbling a museum number on a natural object should not be regarded to make it human-made. This notwithstanding, parts, sections, segments, or features of an instance of E24 Physical Human-Made Thing may continue to be non-human-made and preserved during the production process, for example natural pearls used as a part of an eardrop. Examples: - the Forth Railway Bridge (Shipway, Bouch, Baker and Fowler, 1990). - the Channel Tunnel (E25) (Holliday, Marcou and Vickerman, 1991) - the Palace of Knossos (Evans, 1921) - the Colosseum in Rome, Italy (Hopkins and Beard, 2011) - the Historical Collection of the Museum Benak…
label: E24 Chose matérielle élaborée par l’humain @fr
label: E24 Матeриальный Рукотворный Объeкт @ru
notation: E24
preferred label: Chose matérielle élaborée par l’humain @fr
preferred label: Physical Human-Made Thing
preferred label: Матeриальный Рукотворный Объeкт @ru

E28 Conceptual Object
type: Class
subclass of: E71 Human-Made Thing
comment: Scope note: This class comprises non-material products of our minds and other human produced data that have become objects of a discourse about their identity, circumstances of creation, or historical implication. The production of such information might have been supported by the use of technical devices such as cameras or computers. Characteristically, instances of this class are created, invented or thought by someone, and then may be documented or communicated between persons. Instances of E28 Conceptual Object have the ability to exist on more than one particular carrier at the same time, such as paper, electronic signals, marks, audio media, paintings, photos, human memories, etc. They cannot be destroyed. They exist as long as they can be found on at least one carrier or in at least one human memory. Their existence ends when the last carrier and the last memory are lost. Examples: - Beethoven’s “Ode an die Freude” (Ode to Joy) (E73) (Kershaw, 1999) - the definition of “ontology” in the Oxford English Dictionary (E73) (Oxford University Press, 1989) - the knowledge about the victory at Marathon carried by the famous runner (E89) (Lagos & Karyanos, 2020) - [Explanation note: The following examples illustrate the distinction between a propositional object, its names and its encoded forms. The Maxwell equations (Ball, 1962) are a good example, because they belong to the fundamental laws of physics and their mathematical content yields identical, unambiguous results regardless formulation and encoding.] - “Maxwell equations” (E41) [preferred subject access point from LCSH, http://lccn.loc.gov/sh85082387, accessed 18(th) April 2021. This is only the name for the Maxwell equations as standardized by the Library of Congress and not the equations themselves.] - “Equations, Maxwell” (E41) [variant subject access point from LCSH, http://lccn.loc.gov/sh85082387, accessed 18(th) April 2021. This is another name for the equation standardized by the Library of Congress and…
label: E28 Begrifflicher Gegenstand @de
label: E28 Objet conceptuel @fr
label: E28 Objeto Conceitual @pt
label: E28 Νοητικό Αντικείμενο @el
label: E28 Концeптуальный Объeкт @ru
label: E28 概念对象 @zh
notation: E28
preferred label: Begrifflicher Gegenstand @de
preferred label: Conceptual Object
preferred label: Objet conceptuel @fr
preferred label: Objeto Conceitual @pt
preferred label: Νοητικό Αντικείμενο @el
preferred label: Концeптуальный Объeкт @ru
preferred label: 概念对象 @zh

E2 Temporal Entity
type: Class
subclass of: E1 CRM Entity
comment: Scope note: This class comprises all phenomena, such as the instances of E4 Periods and E5 Events, which happen over a limited extent in time. This extent in time must be contiguous, i.e., without gaps. In case the defining kinds of phenomena for an instance of E2 Temporal Entity cease to happen, and occur later again at another time, we regard that the former instance of E2 Temporal Entity has ended and a new instance has come into existence. In more intuitive terms, the same event cannot happen twice. In some contexts, such phenomena are also called perdurants. This class is disjoint from E77 Persistent Item and is an abstract class that typically has no direct instances. E2 Temporal Entity is specialized into E4 Period, which applies to a particular geographic area (defined with a greater or lesser degree of precision), and E3 Condition State, which applies to instances of E18 Physical Thing. Examples: - Bronze Age (E4) (Childe, 1963) - the earthquake in Lisbon 1755 (E5) (Chester, 2001) - the Peterhof Palace near Saint Petersburg being in ruins from 1944 to 1946 (E3) (Maddox, 2015) In First Order Logic: - E2(x) ⇒ E1(x)
label: E2 Entidade Temporal @pt
label: E2 Entité temporelle @fr
label: E2 Geschehendes @de
label: E2 Έγχρονη Οντότητα @el
label: E2 Врeмeнная Сущность @ru
label: E2 时序实体 @zh
notation: E2
preferred label: Entidade Temporal @pt
preferred label: Entité temporelle @fr
preferred label: Geschehendes @de
preferred label: Temporal Entity
preferred label: Έγχρονη Οντότητα @el
preferred label: Врeмeнная Сущность @ru
preferred label: 时序实体 @zh

E30 Right
type: Class
subclass of: E89 Propositional Object
comment: Scope note: This class comprises legal privileges concerning material and immaterial things or their derivatives. These include reproduction and property rights. Examples: - copyright held by ISO on ISO/CD 21127 - ownership of the “Mona Lisa” by the museum of the Louvre, Paris, France In First Order Logic: - E30(x) ⇒ E89(x)
label: E30 Direitos @pt
label: E30 Droit @fr
label: E30 Recht @de
label: E30 Δικαίωμα @el
label: E30 Право @ru
label: E30 权限 @zh
notation: E30
preferred label: Direitos @pt
preferred label: Droit @fr
preferred label: Recht @de
preferred label: Right
preferred label: Δικαίωμα @el
preferred label: Право @ru
preferred label: 权限 @zh

E33 Linguistic Object
type: Class
subclass of: E73 Information Object
comment: Scope note: This class comprises identifiable expressions in natural language or languages. Instances of E33 Linguistic Object can be expressed in many ways: e.g. as written texts, recorded speech, or sign language. However, the CIDOC CRM treats instances of E33 Linguistic Object independently from the medium or method by which they are expressed. Expressions in formal languages, such as computer code or mathematical formulae, are not treated as instances of E33 Linguistic Object by the CIDOC CRM. These should be modelled as instances of E73 Information Object. In general, an instance of E33 Linguistic Object may also contain non-linguistic information, often of artistic or aesthetic value. Only in cases in which the content of an instance of E33 Linguistic Object can completely be expressed by a series of binary-encoded symbols, its content may be documented within a respective knowledge base by the property P190 has symbolic content: E62 String. Otherwise, it should be understood as an identifiable digital resource only available independently from the respective knowledge base. In other cases, such as pages of an illuminated manuscript or recordings containing speech in a language supported by a writing system, the linguistic part of the content of an instance of E33 Linguistic Object may be documented within a respective knowledge base in a note by P3 has note: E62 String. Otherwise, it may be described using the property P165 incorporates (is incorporated in): E73 Information Object as a different object with its own identity. Examples: - the text of the Ellesmere Chaucer manuscript (Hilmo, 2019) - the lyrics of the song “Blue Suede Shoes” (Cooper, 2008) - the text of the “Jabberwocky” by Lewis Carroll (Carroll, 1981) - the text of “Doktoro Jekyll kaj Sinjoro Hyde” [an Esperanto translation of Dr. Jekyll and Mr. Hyde]. (Stevenson, Morrison and Mann, 1909) - the free dialog in the local dialect recorded in 1958, Telemark, Norway stored on tape or.7-89.s1 (00.15:…
label: E33 Objet linguistique @fr
label: E33 Objeto Lingüístico @pt
label: E33 Sprachlicher Gegenstand @de
label: E33 Γλωσσικό Αντικείμενο @el
label: E33 Лингвистичeский Объeкт @ru
label: E33 语言对象 @zh
notation: E33
preferred label: Linguistic Object
preferred label: Objet linguistique @fr
preferred label: Objeto Lingüístico @pt
preferred label: Sprachlicher Gegenstand @de
preferred label: Γλωσσικό Αντικείμενο @el
preferred label: Лингвистичeский Объeкт @ru
preferred label: 语言对象 @zh

E35 Title
type: Class
subclass of: E33 Linguistic Object
subclass of: E41 Appellation
comment: Scope note: This class comprises the textual strings that within a cultural context can be clearly identified as titles due to their form. Being a subclass of E41 Appellation, E35 Title can only be used when such a string is actually used as a title of a work, such as a text, an artwork, or a piece of music. Titles are proper noun phrases or verbal phrases, and should not be confused with generic object names such as “chair”, “painting”, or “book” (the latter are common nouns that stand for instances of E55 Type). Titles may be assigned by the creator of the work itself, or by a social group. This class also comprises the translations of titles that are used as surrogates for the original titles in different social contexts. Examples: - “The Merchant of Venice” (McCullough, 2005) - “Mona Lisa” (Mohen, Menu and Mottin, 2006) - “La Pie” (Bortolatto, 1981) - “Lucy in the Sky with Diamonds” (Lennon, 1967) In First Order Logic: - E35(x) ⇒ E33(x) - E35(x) ⇒ E41(x)
label: E35 Titel @de
label: E35 Titre @fr
label: E35 Título @pt
label: E35 Τίτλος @el
label: E35 Названиe @ru
label: E35 题名 @zh
notation: E35
preferred label: Titel @de
preferred label: Title
preferred label: Titre @fr
preferred label: Título @pt
preferred label: Τίτλος @el
preferred label: Названиe @ru
preferred label: 题名 @zh

E36 Visual Item
type: Class
subclass of: E73 Information Object
comment: Scope note: This class comprises the intellectual or conceptual aspects of recognisable marks and images. This class does not intend to describe the idiosyncratic characteristics of an individual physical embodiment of a visual item, but the underlying prototype. For example, a mark such as the ICOM logo is generally considered to be the same logo when used on any number of publications. The size, orientation, and colour may change, but the logo remains uniquely identifiable. The same is true of images that are reproduced many times. This means that visual items are independent of their physical support. The E36 Visual Item class provides a means of identifying and linking together instances of E24 Physical Human-Made Thing that carry the same visual symbols, marks, or images, etc. The property P62 depicts (is depicted by) between E24 Physical Human-Made Thing and the depicted subjects (E1 CRM Entity) can be regarded as a shortcut of the more fully developed path from E24 Physical Human-Made Thing through P65 shows visual item (is shown by), E36 Visual Item, P138 represents (has representation) to E1 CRM Entity, which in addition captures the optical features of the depiction. Examples: - the visual appearance of Monet’s “La Pie” (Bortolatto, 1981) - the Coca-Cola logo (E34) - the Chi-Rho (E37) - the communist red star (E37) - the surface shape of Auguste Rodin's statue "Le Penseur" [There exist more than 20 copies, even of different size. Therefore, this is a good example that it is only the common surface shape, an immaterial visual item, which justifies displaying these copies as works of Auguste Rodin. As usual practice, Rodin himself did not produce the bronze statue, but only the prototype model.] In First Order Logic: - E36(x) ⇒ E73(x)
label: E36 Bildliches @de
label: E36 Entité visuelle @fr
label: E36 Item Visual @pt
label: E36 Οπτικό Στοιχείο @el
label: E36 Визуальный Прeдмeт @ru
label: E36 可视项 @zh
notation: E36
preferred label: Bildliches @de
preferred label: Entité visuelle @fr
preferred label: Item Visual @pt
preferred label: Visual Item
preferred label: Οπτικό Στοιχείο @el
preferred label: Визуальный Прeдмeт @ru
preferred label: 可视项 @zh

E39 Actor
type: Class
subclass of: E77 Persistent Item
comment: Scope note: This class comprises people, either individually or in groups, who have the potential to perform intentional actions of kinds for which they can be held responsible. Examples: - London and Continental Railways (E74) - the Governor of the Bank of England in 1975 (E21) - Sir Ian McKellen (E21) (Gibson, 1986) In First Order Logic: - E39(x) ⇒ E77(x)
label: E39 Actant @fr
label: E39 Agente @pt
label: E39 Akteur @de
label: E39 Δράστης @el
label: E39 Дeйствующий Субъeкт @ru
label: E39 参与者 @zh
notation: E39
preferred label: Actant @fr
preferred label: Actor
preferred label: Agente @pt
preferred label: Akteur @de
preferred label: Δράστης @el
preferred label: Дeйствующий Субъeкт @ru
preferred label: 参与者 @zh

E3 Condition State
type: Class
subclass of: E2 Temporal Entity
comment: Scope note: This class comprises the states of objects characterised by a certain condition over a time-span. An instance of this class describes the prevailing physical condition of any material object or feature during a specific instance of E52 Time-Span. In general, the time-span for which a certain condition can be asserted may be shorter than the real time-span, for which this condition held. The nature of that condition can be described using P2 has type. For example, the instance of E3 Condition State “condition of the SS Great Britain between 22(nd) September 1846 and 27(th) August 1847” can be characterized as an instance “wrecked” of E55 Type. Examples: - the "reconstructed" state of the “Amber Room” in Tsarskoje Selo from summer 2003 until now (Owen, 2009) - the "ruined" state of Peterhof Palace near Saint Petersburg from 1944 to 1946 (Maddox, 2015) - the state of my turkey in the oven at 14:30 on 25(th) December 2002 [P2 has type: E55 Type “still not cooked”] (fictitious) - the topography of the leaves of Sinai Printed Book 3234.2361 on the 10(th) July 2007 [described as: of type "cockled"] (fictitious) In First Order Logic: - E3(x) ⇒ E2(x)
label: E3 Estado Material @pt
label: E3 Zustandsphase @de
label: E3 État matériel @fr
label: E3 Κατάσταση @el
label: E3 Состояниe @ru
label: E3 条件状态 @zh
notation: E3
preferred label: Condition State
preferred label: Estado Material @pt
preferred label: Zustandsphase @de
preferred label: État matériel @fr
preferred label: Κατάσταση @el
preferred label: Состояниe @ru
preferred label: 条件状态 @zh

E41 Appellation
type: Class
subclass of: E90 Symbolic Object
comment: Scope note: This class comprises all signs, either meaningful or not, or arrangements of signs following a specific syntax, that are used or can be used to refer to and identify a specific instance of some class within a certain context. Instances of E41 Appellation do not identify things by their meaning, even if they happen to have one, but by convention, tradition, or agreement. Instances of E41 Appellation are cultural constructs; as such, they have a context, a history, and a use in time and space by some group of users. A given instance of E41 Appellation can have alternative forms, i.e. other instances of E41 Appellation that are regarded as equivalent, regardless of the thing it denotes. Different languages may use different appellations for the same thing, such as the names of major cities. Some appellations may be formulated using a valid noun phrase of a particular language. In these cases, the respective instances of E41 Appellation should also be declared as instances of E33 Linguistic Object. Then the language using the appellation can be declared with the property P72 has language: E56 Language. Instances of E41 Appellation may be used to identify any instance of E1 CRM Entity and sometimes are characteristic for instances of more specific subclasses of E1 CRM Entity, such as for instances of E52 Time-Span (for instance “dates”), E39 Actor, E53 Place or E28 Conceptual Object. Postal addresses and E-mail addresses are characteristic examples of identifiers used by services transporting things between clients. Even numerically expressed identifiers for extents in space or time are also regarded as instances of E41 Appellation, such as Gregorian dates or spatial coordinates, even though they allow for determining some time or location by a known procedure starting from a reference point and by virtue of that fact play a double role as instances of E59 Primitive Value. E41 Appellation should not be confused with the act of naming something. Cf. E15 Identi…
label: E41 Benennung @de
label: E41 Designação @pt
label: E41 Ονομασία @el
label: E41 Обозначeниe @ru
label: E41 称谓 @zh
notation: E41
preferred label: Appellation
preferred label: Benennung @de
preferred label: Designação @pt
preferred label: Ονομασία @el
preferred label: Обозначeниe @ru
preferred label: 称谓 @zh

E42 Identifier
type: Class
subclass of: E41 Appellation
comment: Scope note: This class comprises strings or codes assigned to instances of E1 CRM Entity in order to identify them uniquely and permanently within the context of one or more organisations. Such codes are often known as inventory numbers, registration codes, etc. and are typically composed of alphanumeric sequences. Postal addresses, telephone numbers, URLs and e-mail addresses are characteristic examples of identifiers used by services transporting things between clients. The class E42 Identifier is not normally used for machine-generated identifiers used for automated processing unless these are also used by human agents. Examples: - “MM.GE.195” - “13.45.1976” - “OXCMS: 1997.4.1” (fictitious) - “ISSN 0041-5278” [Identifier for “The UNESCO Courier (Print)”] - ISRC “FIFIN8900186” [Identifier for : Kraft (29 min 14 s) / Magnus Lindberg, comp. ; Toimii Ensemble ; Swedish Radio symphony orchestra ; Esa-Pekka Salonen, dir.] - Shelf mark “Res 8 P 10” - “Guillaume de Machaut (1300?-1377)” [a controlled personal name heading that follows the French rules] (Reaney, 1974) - “+41 22 418 5571” - “ weasel@paveprime.com” - “Rue David Dufour 5, CH-1211, Genève” - “1-29-3 Otsuka, Bunkyo-ku, Tokyo, 121, Japan” In First Order Logic: - E42(x) ⇒ E41(x)
label: E42 Identifiant @fr
label: E42 Identificador de Objeto @pt
label: E42 Kennung @de
label: E42 Κωδικός Αναγνώρισης @el
label: E42 Идeнтификатор @ru
label: E42 标识符 @zh
notation: E42
preferred label: Identifiant @fr
preferred label: Identificador de Objeto @pt
preferred label: Identifier
preferred label: Kennung @de
preferred label: Κωδικός Αναγνώρισης @el
preferred label: Идeнтификатор @ru
preferred label: 标识符 @zh

E4 Period
type: Class
subclass of: E2 Temporal Entity
subclass of: E92 Spacetime Volume
comment: Scope note: This class comprises sets of coherent phenomena or cultural manifestations occurring in time and space. It is the social or physical coherence of these phenomena that identify an instance of E4 Period and not the associated spatiotemporal extent. This extent is only the “ground” or space in an abstract physical sense that the actual process of growth, spread and retreat has covered. Consequently, different periods can overlap and coexist in time and space, such as when a nomadic culture exists in the same area and time as a sedentary culture. This also means that overlapping land use rights, common among first nations, amounts to overlapping periods. Often, this class is used to describe prehistoric or historic periods such as the “Neolithic Period”, the “Ming Dynasty” or the “McCarthy Era”, but also geopolitical units and activities of settlements are regarded as special cases of E4 Period. However, there are no assumptions about the scale of the associated phenomena. In particular all events are seen as synthetic processes consisting of coherent phenomena. Therefore, E4 Period is a superclass of E5 Event. For example, a modern clinical birth, an instance of E67 Birth, can be seen as both a single event, i.e. an instance of E5 Event, and as an extended period, i.e. an instance of E4 Period, that consists of multiple physical processes and complementary activities performed by multiple instances of E39 Actor. E4 Period is a subclass of E2 Temporal Entity and of E92 Spacetime Volume. The latter is intended as a phenomenal spacetime volume as defined in CIDOC CRMgeo (Doerr & Hiebel, 2013). By virtue of this multiple inheritance, it is possible to discuss the physical extent of an instance of E4 Period without representing each instance of it together with an instance of its associated spacetime volume. This model combines two quite different kinds of substance: an instance of E4 Period is a phenomenon while an instance of E92 Spacetime Volume is an aggrega…
label: E4 Período @pt
label: E4 Phase @de
label: E4 Période @fr
label: E4 Περίοδος @el
label: E4 Пeриод @ru
label: E4 时期 @zh
notation: E4
preferred label: Period
preferred label: Período @pt
preferred label: Phase @de
preferred label: Période @fr
preferred label: Περίοδος @el
preferred label: Пeриод @ru
preferred label: 时期 @zh

E52 Time-Span
type: Class
subclass of: E1 CRM Entity
comment: Scope note: This class comprises abstract temporal extents, in the sense of Galilean physics, having a beginning, an end, and a duration. Instances of E52 Time-Span have no semantic connotations about phenomena happening within the temporal extent they represent. They do not convey any meaning other than a positioning on the “time-line” of chronology. The actual extent of an instance of E52 Time-Span can be approximated by properties of E52 Time-Span giving inner and outer bounds in the form of dates (instances of E61 Time Primitive). Comparing knowledge about time-spans is fundamental for chronological reasoning. Some instances of E52 Time-Span may be defined as the actual, in principle observable, temporal extent of instances of E2 Temporal Entity via the property P4 has time-span (is time-span of): E52 Time-Span. They constitute phenomenal time-spans as defined in CRMgeo (Doerr & Hiebel 2013). Since our knowledge of history is imperfect and physical phenomena are fuzzy in nature, the extent of phenomenal time-spans can only be described in approximation. An extreme case of approximation, might, for example, define an instance of E52 Time-Span having unknown beginning, end and duration. It may, nevertheless, be associated with other descriptions by which people can infer knowledge about it, such as in relative chronologies. Some instances of E52 may be defined precisely as representing a declaration of a temporal extent, as, for instance, done in a business contract. They constitute declarative time-spans as defined in CRMgeo (Doerr & Hiebel 2013) and can be described via the property E61 Time Primitive P170 defines time (time is defined by): E52 Time-Span. When used as a common E52 Time-Span for two events, it will nevertheless describe them as being simultaneous, even if nothing else is known. Examples: - 1961 - From 12-17-1993 to 12-8-1996 - 14h30 to 16h22 4(th) July 1945 - 9.30 am 1.1.1999 to 2.00 pm 1.1.1999 - the time-span of the Ming Dynasty (Chan, 2011) In…
label: E52 Intervalle temporel @fr
label: E52 Período de Tempo @pt
label: E52 Zeitspanne @de
label: E52 Χρονικό Διάστημα @el
label: E52 Интeрвал Врeмeни @ru
label: E52 时段 @zh
notation: E52
preferred label: Intervalle temporel @fr
preferred label: Período de Tempo @pt
preferred label: Time-Span
preferred label: Zeitspanne @de
preferred label: Χρονικό Διάστημα @el
preferred label: Интeрвал Врeмeни @ru
preferred label: 时段 @zh

E53 Place
type: Class
subclass of: E1 CRM Entity
comment: Scope note: This class comprises extents in the natural space where people live, in particular on the surface of the Earth, in the pure sense of physics: independent from temporal phenomena and matter. They may serve describing the physical location of things or phenomena or other areas of interest. Geometrically, instances of E53 Place constitute single contiguous areas or a finite aggregation of disjoint areas in space which are each individually contiguous. They may have fuzzy boundaries. The instances of E53 Place are usually determined by reference to the position of “immobile” objects such as buildings, cities, mountains, rivers, or dedicated geodetic marks, but may also be determined by reference to mobile objects. A Place can be determined by combining a frame of reference and a location with respect to this frame. It is sometimes argued that instances of E53 Place are best identified by global coordinates or absolute reference systems. However, relative references are often more relevant in the context of cultural documentation and tend to be more precise. In particular, people are often interested in position in relation to large, mobile objects, such as ships. For example, the Place at which Nelson died is known with reference to a large mobile object, i.e. H.M.S Victory. A resolution of this Place in terms of absolute coordinates would require knowledge of the movements of the vessel and the precise time of death, either of which may be revised, and the result would lack historical and cultural relevance. Any instance of E18 Physical Thing can serve as a frame of reference for an instance of E53 Place. This may be documented using the property P157 is at rest relative to (provides reference space for). Examples: - the extent of the UK in the year 2003 - the position of the hallmark on the inside of my wedding ring (fictitious) - the place referred to in the phrase: “Fish collected at three miles north of the confluence of the Arve and the Rhone” - here -…
label: E53 Lieu @fr
label: E53 Local @pt
label: E53 Ort @de
label: E53 Τόπος @el
label: E53 Мeсто @ru
label: E53 地点 @zh
notation: E53
preferred label: Lieu @fr
preferred label: Local @pt
preferred label: Ort @de
preferred label: Place
preferred label: Τόπος @el
preferred label: Мeсто @ru
preferred label: 地点 @zh

E54 Dimension
type: Class
subclass of: E1 CRM Entity
comment: Scope note: This class comprises quantifiable properties that can be measured by some calibrated means and can be approximated by values, i.e. points or regions in a mathematical or conceptual space, such as natural or real numbers, RGB values, etc. An instance of E54 Dimension represents the empirical or theoretically derived quantity, including the precision tolerances resulting from the particular method or calculation. The identity of an instance of E54 Dimension depends on the method of its determination because each method may produce different values even when determining comparable qualities. For instance, the wingspan of a bird alive or dead is a different dimension. Thermoluminescence dating and Rehydroxylation [RHX] dating are different dimensions of temporal distance from now, even if they aim at dating the same object. The method of determination should be expressed using the property P2 has type (is type of). Note that simple terms such as “diameter” or “length” are normally insufficient to unambiguously describe a respective dimension. In contrast, “maximum linear extent” may be sufficient. The properties of the class E54 Dimension allow for expressing the numerical approximation of the values of instances of E54 Dimension adequate to the precision of the applied method of determination. If the respective quantity belongs to a non-discrete space according to the laws of physics, such as spatial distances, it is recommended to record them as approximations by intervals or regions of indeterminacy enclosing the assumed true values. For instance, a length of 5 cm may be recorded as 4.5-5.5 cm, according to the precision of the respective observation. Note, that comparability of values described in different units depends critically on the representation as value regions. Numerical approximations in archaic instances of E58 Measurement Unit used in historical records should be preserved. Equivalents corresponding to current knowledge should be recorded as…
label: E54 Dimensão @pt
label: E54 Maß @de
label: E54 Μέγεθος @el
label: E54 Размeр @ru
label: E54 度量规格 @zh
notation: E54
preferred label: Dimension
preferred label: Dimensão @pt
preferred label: Maß @de
preferred label: Μέγεθος @el
preferred label: Размeр @ru
preferred label: 度量规格 @zh

E55 Type
type: Class
subclass of: E28 Conceptual Object
comment: Scope note: This class comprises concepts denoted by terms from thesauri and controlled vocabularies used to characterize and classify instances of CIDOC CRM classes. Instances of E55 Type represent concepts, in contrast to instances of E41 Appellation which are used to name instances of CIDOC CRM classes. E55 Type provides an interface to domain specific ontologies and thesauri. These can be represented in the CIDOC CRM as subclasses of E55 Type, forming hierarchies of terms, i.e. instances of E55 Type linked via P127 has broader term (has narrower term): E55 Type. Such hierarchies may be extended with additional properties. Examples: - weight, length, depth [types for instances of E54 Dimension] - portrait, sketch, animation [types for instances of E36 Visual Item] - French, English, German [types for instances of E56 Language] - excellent, good, poor [types for instances of E3 Condition State] - Ford Model T, chop stick [types for instances of E22 Human-Made Object] - cave, doline, scratch [types for instances of E26 Physical Feature] - poem, short story [types for instances of E33 Linguistic Object] - wedding, earthquake, skirmish [types for instances of E5 Event] In First Order Logic: - E55(x) ⇒ E28(x)
label: E55 Tipo @pt
label: E55 Typus @de
label: E55 Tип @ru
label: E55 Τύπος @el
label: E55 类型 @zh
notation: E55
preferred label: Tipo @pt
preferred label: Type
preferred label: Typus @de
preferred label: Tип @ru
preferred label: Τύπος @el
preferred label: 类型 @zh

E57 Material
type: Class
subclass of: E55 Type
comment: Scope note: This class is a specialization of E55 Type and comprises the concepts of materials. Instances of E57 Material may denote properties of matter before its use, during its use, and as incorporated in an object, such as ultramarine powder, tempera paste, reinforced concrete. Discrete pieces of raw-materials kept in museums, such as bricks, sheets of fabric, pieces of metal, should be modelled individually in the same way as other objects. Discrete used or processed pieces, such as the stones from Nefer Titi's temple, should be modelled as parts (cf. P46 is composed of (forms part of): E18 Physical Thing). This type is used categorically in the model without reference to instances of it, i.e. the Model does not foresee the description of instances of instances of E57 Material, e.g. “instances of gold”. It is recommended that internationally or nationally agreed codes and terminology should be used. Examples: - brick (Gurcke, 1987) - gold (Watson, 1990) - aluminium (Norman, 1986) - polycarbonate (Mhaske, 2011) - resin (Barton, 1992) In First Order Logic: - E57(x) ⇒ E55(x)
label: E57 Matériau @fr
label: E57 Υλικό @el
label: E57 Матeриал @ru
label: E57 材质 @zh
notation: E57
preferred label: Material
preferred label: Matériau @fr
preferred label: Υλικό @el
preferred label: Матeриал @ru
preferred label: 材质 @zh

E58 Measurement Unit
type: Class
subclass of: E55 Type
comment: Scope note: This class is a specialization of E55 Type and comprises the types of measurement units: feet, inches, centimetres, litres, lumens, etc. This type is used categorically in the model without reference to instances of it, i.e. the model does not foresee the description of instances of instances of E58 Measurement Unit, e.g. “instances of cm”. Système International (SI) units or internationally recognized non-SI terms should be used whenever possible, such as those defined by ISO80000:2009. Archaic Measurement Units used in historical records should be preserved. Examples: - cm [centimetre] - km [kilometre] - m [metre] - m/s [metres per second] (Hau et al., 1999) - A [ampere] - GRD [Greek Drachma] (E98) (Daniel, 2014) - C [degrees centigrade] (Beckman, 1998) In First Order Logic: - E58(x) ⇒ E55(x)
label: E58 Eдиница Измeрeния @ru
label: E58 Maßeinheit @de
label: E58 Unidade de Medida @pt
label: E58 Unité de mesure @fr
label: E58 Μονάδα Μέτρησης @el
label: E58 测量单位 @zh
notation: E58
preferred label: Eдиница Измeрeния @ru
preferred label: Maßeinheit @de
preferred label: Measurement Unit
preferred label: Unidade de Medida @pt
preferred label: Unité de mesure @fr
preferred label: Μονάδα Μέτρησης @el
preferred label: 测量单位 @zh

E5 Event
type: Class
subclass of: E4 Period
comment: Scope note: This class comprises distinct, delimited and coherent processes and interactions of a material nature, in cultural, social or physical systems, involving and affecting instances of E77 Persistent Item in a way characteristic of the kind of process. Typical examples are meetings, births, deaths, actions of decision taking, making or inventing things, but also more complex and extended ones such as conferences, elections, building of a castle, or battles. While the continuous growth of a tree lacks the limits characteristic of an event, its germination from a seed does qualify as an event. Similarly, the blowing of the wind lacks the distinctness and limits of an event, but a hurricane, flood or earthquake would qualify as an event. Mental processes are considered as events, in cases where they are connected with the material externalization of their results; for example, the creation of a poem, a performance or a change of intention that becomes obvious from subsequent actions or declarations. The effects of an instance of E5 Event may not lead to relevant permanent changes of properties or relations of the items involved in it, for example an unrecorded performance. Of course, in order to be documented, some kind of evidence for an event must exist, be it witnesses, traces or products of the event. While instances of E4 Period always require some form of coherence between its constituent phenomena, in addition, the essential constituents of instances of E5 Event should contribute to an overall effect; for example, the statements made during a meeting and the listening of the audience. Viewed at a coarse level of detail, an instance of E5 Event may appear as if it had an ‘instantaneous’ overall effect, but any process or interaction of material nature in reality have an extent in time and space. At a fine level, instances of E5 Event may be analysed into component phenomena and phases within a space and timeframe, and as such can be seen as a period, rega…
label: E5 Ereignis @de
label: E5 Evento @pt
label: E5 Évènement @fr
label: E5 Συμβάν @el
label: E5 Событиe @ru
label: E5 事件 @zh
notation: E5
preferred label: Ereignis @de
preferred label: Event
preferred label: Evento @pt
preferred label: Évènement @fr
preferred label: Συμβάν @el
preferred label: Событиe @ru
preferred label: 事件 @zh

E63 Beginning of Existence
type: Class
subclass of: E5 Event
comment: Scope note: This class comprises events that bring into existence any instance of E77 Persistent Item. It may be used for temporal reasoning about things (intellectual products, physical items, groups of people, living beings) beginning to exist; it serves as a hook for both a terminus post quem and a terminus ante quem. Examples: - the birth of my child (E67) (fictitious) - the birth of Snoopy, my dog (fictitious) - the calving of the iceberg that sank the Titanic - the construction of the Eiffel Tower (E12) (Tissandier, 1889) In First Order Logic: - E63(x) ⇒ E5(x)
label: E63 Daseinsbeginn @de
label: E63 Début d’existence @fr
label: E63 Início da Existência @pt
label: E63 Αρχή Ύπαρξης @el
label: E63 Начало Сущeствования @ru
label: E63 初始 @zh
notation: E63
preferred label: Beginning of Existence
preferred label: Daseinsbeginn @de
preferred label: Début d’existence @fr
preferred label: Início da Existência @pt
preferred label: Αρχή Ύπαρξης @el
preferred label: Начало Сущeствования @ru
preferred label: 初始 @zh

E64 End of Existence
type: Class
subclass of: E5 Event
comment: Scope note: This class comprises events that end the existence of any instance of E77 Persistent Item. It may be used for temporal reasoning about things (physical items, groups of people, living beings) ceasing to exist; it serves as a hook both a terminus post quem and a terminus ante quem. In cases where substance from an instance of E77 Persistent Item continues to exist in a new form, the process would be documented as instances of E81 Transformation. Examples: - the death of Snoopy, my dog (fictitious) - the melting of the snowman (E6) - the burning of the Temple of Artemis in Ephesos by Herostratos in 356 BC (E7, E6) (Trell, 1945) In First Order Logic: - E64(x) ⇒ E5(x)
label: E64 Daseinsende @de
label: E64 Fim da Existência @pt
label: E64 Fin d’existence @fr
label: E64 Τέλος Ύπαρξης @el
label: E64 Конeц Сущeствования @ru
label: E64 结束 @zh
notation: E64
preferred label: Daseinsende @de
preferred label: End of Existence
preferred label: Fim da Existência @pt
preferred label: Fin d’existence @fr
preferred label: Τέλος Ύπαρξης @el
preferred label: Конeц Сущeствования @ru
preferred label: 结束 @zh

E65 Creation
type: Class
subclass of: E63 Beginning of Existence
subclass of: E7 Activity
comment: Scope note: This class comprises events that result in the creation of conceptual items or immaterial products, such as legends, poems, texts, music, images, movies, laws, types, etc. Examples: - the framing of the U.S. Constitution (Farrand, 1913) - the drafting of U.N. Resolution 1441 (United Nations Security Council, 2002) In First Order Logic: - E65(x) ⇒ E7(x) - E65(x) ⇒ E63(x)
label: E65 Begriffliche Schöpfung @de
label: E65 Criação @pt
label: E65 Création @fr
label: E65 Δημιουργία @el
label: E65 Созданиe @ru
label: E65 创建 @zh
notation: E65
preferred label: Begriffliche Schöpfung @de
preferred label: Creation
preferred label: Criação @pt
preferred label: Création @fr
preferred label: Δημιουργία @el
preferred label: Созданиe @ru
preferred label: 创建 @zh

E67 Birth
type: Class
subclass of: E63 Beginning of Existence
comment: Scope note: This class comprises the births of human beings. E67 Birth is a biological event focussing on the context of people coming into life. (E63 Beginning of Existence comprises the coming into life of any living being.) Twins, triplets, etc. are brought into life by the same instance of E67 Birth. The introduction of the E67 Birth event as a documentation element allows the description of a range of family relationships in a simple model. Suitable extensions may describe more details and the complexity of motherhood since the advent of modern medicine. In this model, the biological father is not seen as a necessary participant in the E67 Birth. Examples: - the birth of Alexander the Great (Stoneman, 2004) In First Order Logic: - E67(x) ⇒ E63(x)
label: E67 Geburt @de
label: E67 Naissance @fr
label: E67 Nascimento @pt
label: E67 Γέννηση @el
label: E67 Рождeниe @ru
label: E67 出生 @zh
notation: E67
preferred label: Birth
preferred label: Geburt @de
preferred label: Naissance @fr
preferred label: Nascimento @pt
preferred label: Γέννηση @el
preferred label: Рождeниe @ru
preferred label: 出生 @zh

E69 Death
type: Class
subclass of: E64 End of Existence
comment: Scope note: This class comprises the deaths of human beings. If a person is killed, their death should be instantiated as E69 Death and as E7 Activity. The death or perishing of other living beings should be documented as instances of E64 End of Existence. Examples: - the murder of Julius Caesar (E69, E7) (Irwin, 1935) - the death of Senator Paul Wellstone (Monast and Tao, 2002) In First Order Logic: - E69(x) ⇒ E64(x)
label: E69 Mort @fr
label: E69 Morte @pt
label: E69 Tod @de
label: E69 Θάνατος @el
label: E69 Смeрть @ru
label: E69 死亡 @zh
notation: E69
preferred label: Death
preferred label: Mort @fr
preferred label: Morte @pt
preferred label: Tod @de
preferred label: Θάνατος @el
preferred label: Смeрть @ru
preferred label: 死亡 @zh

E70 Thing
type: Class
subclass of: E77 Persistent Item
comment: Scope note: This general class comprises discrete, identifiable, instances of E77 Persistent Item that are documented as single units, that either consist of matter or depend on being carried by matter and are characterized by relative stability. They may be intellectual products or physical things. They may, for instance, have a solid physical form, an electronic encoding, or they may be a logical concept or structure. Examples: - my photograph collection (E78) (fictitious) - the bottle of milk in my refrigerator (E22) (fictitious) - the Riss A1 plan of the Straßburger Münster (French: Cathédrale Notre-Dame de Strasbourg) (E29) (Liess, R., 1985) - the thing on the top of Otto Hahn’s desk (E19) - the form of the no-smoking sign (E36) - the cave of Dirou, Mani, Greece (E26) (Psimenos, 2005) In First Order Logic: - E70(x) ⇒ E77(x)
label: E70 Chose @fr
label: E70 Coisa @pt
label: E70 Sache @de
label: E70 Πράγμα @el
label: E70 Вeщь @ru
label: E70 事物 @zh
notation: E70
preferred label: Chose @fr
preferred label: Coisa @pt
preferred label: Sache @de
preferred label: Thing
preferred label: Πράγμα @el
preferred label: Вeщь @ru
preferred label: 事物 @zh

E71 Human-Made Thing
type: Class
subclass of: E70 Thing
comment: Scope note: This class comprises discrete, identifiable human-made items that are documented as single units. These items are either intellectual products or human-made physical things, and are characterized by relative stability. They may, for instance, have a solid physical form, an electronic encoding, or they may be logical concepts or structures. Examples: - Beethoven’s 5(th) Symphony (E73) (Lockwood, 2015) - Michelangelo’s David (E22) (Paoletti and Bagemihl, 2015) - Einstein’s Theory of General Relativity (E89) (Hartle, 2003) - the taxon ‘Fringilla coelebs Linnaeus,1758’ (E55) (Sinkevicius and Narusevicius, 2002) In First Order Logic: - E71(x) ⇒ E70(x)
label: E71 Chose élaborée par l’humain @fr
label: E71 Рукотворный Прeдмeт @ru
notation: E71
preferred label: Chose élaborée par l’humain @fr
preferred label: Human-Made Thing
preferred label: Рукотворный Прeдмeт @ru

E72 Legal Object
type: Class
subclass of: E70 Thing
comment: Scope note: This class comprises those material or immaterial items to which instances of E30 Right, such as the right of ownership or use, can be applied. This is generally true for all instances of E18 Physical Thing. In the case of instances of E28 Conceptual Object, however, the identity of an instance of E28 Conceptual Object or the method of its use may be too ambiguous to reliably establish instances of E30 Right, as in the case of taxa and inspirations. Ownership of corporations is currently regarded as out of scope of the CIDOC CRM. Examples: - the Cullinan diamond (E19) (Scarratt and Shor, 2006) - definition of the CIDOC Conceptual Reference Model Version 5.0.4 (E73) (ISO 21127: 2014) In First Order Logic: - E72(x) ⇒ E70(x)
label: E72 Objet juridique @fr
label: E72 Objeto Jurídico @pt
label: E72 Rechtsobjekt @de
label: E72 Νομικό Αντικείμενο @el
label: E72 Объeкт Права @ru
label: E72 法律对象 @zh
notation: E72
preferred label: Legal Object
preferred label: Objet juridique @fr
preferred label: Objeto Jurídico @pt
preferred label: Rechtsobjekt @de
preferred label: Νομικό Αντικείμενο @el
preferred label: Объeкт Права @ru
preferred label: 法律对象 @zh

E73 Information Object
type: Class
subclass of: E89 Propositional Object
subclass of: E90 Symbolic Object
comment: Scope note: This class comprises identifiable immaterial items, such as poems, jokes, data sets, images, texts, multimedia objects, procedural prescriptions, computer program code, algorithm or mathematical formulae, that have an objectively recognizable structure and are documented as single units. The encoding structure known as a “named graph” also falls under this class, so that each “named graph” is an instance of E73 Information Object. An instance of E73 Information Object does not depend on a specific physical carrier, which can include human memory, and it can exist on one or more carriers simultaneously. Instances of E73 Information Object of a linguistic nature should be declared as instances of the E33 Linguistic Object subclass. Instances of E73 Information Object of a documentary nature should be declared as instances of the E31 Document subclass. Conceptual items such as types and classes are not instances of E73 Information Object, nor are ideas without a reproducible expression. Examples: - image BM000038850.JPG from the Clayton Herbarium in London (E31) (Natural History Museum, 2021) - E. A. Poe's “The Raven” (Poe, 1869) - the movie “The Seven Samurai” by Akira Kurosawa (Mellen, 2002) - the text of Huray describing the Maxwell Equations (Huray, 2010) - the Getty AAT as published as Linked Open Data, accessed 1/10/2014 In First Order Logic: - E73(x) ⇒ E89(x) - E73(x) ⇒ E90(x)
label: E73 Informationsgegenstand @de
label: E73 Objet informationnel @fr
label: E73 Objeto de Informação @pt
label: E73 Πληροφοριακό Αντικείμενο @el
label: E73 Информационный Объeкт @ru
label: E73 信息对象 @zh
notation: E73
preferred label: Information Object
preferred label: Informationsgegenstand @de
preferred label: Objet informationnel @fr
preferred label: Objeto de Informação @pt
preferred label: Πληροφοριακό Αντικείμενο @el
preferred label: Информационный Объeкт @ru
preferred label: 信息对象 @zh

E74 Group
type: Class
subclass of: E39 Actor
comment: Scope note: This class comprises any gatherings or organizations of human individuals or groups that act collectively or in a similar way due to any form of unifying relationship. In the wider sense this class also comprises official positions which used to be regarded in certain contexts as one actor, independent of the current holder of the office, such as the president of a country. In such cases, it may happen that the group never had more than one member. A joint pseudonym (i.e. a name that seems indicative of an individual but that is actually used as a persona by two or more people) is a particular case of E74 Group. A gathering of people becomes an instance of E74 Group when it exhibits organizational characteristics usually typified by a set of ideas or beliefs held in common, or actions performed together. These might be communication, creating some common artifact, a common purpose such as study, worship, business, sports, etc. Nationality can be modelled as membership in an instance of E74 Group. Married couples and other concepts of family are regarded as particular examples of E74 Group. Examples: - the Impressionists (Wilson, 1994) - the Navajo (Correll, 1972) - the Greeks (Williams, 1993) - the peace protestors in New York City on 15(th) February 2003 - Exxon-Mobil (Raymond, 2006) - King Solomon and his wives (Thieberger, 1947) - the President of the Swiss Confederation - Nicolas Bourbaki [the collective pseudonym of a group of mathematicians, predominantly French alumni of the École normale supérieure] (Aczel, 2007) - Betty Crocker (Crocker, 2012) - Ellery Queen [Ellery Queen is a pseudonym created in 1929 by American crime fiction writers Frederic Dannay and Manfred Bennington Lee.] (Wheat, 2005) - Greenpeace - Paveprime Ltd - the National Museum of Denmark In First Order Logic: - E74(x) ⇒ E39(x)
label: E74 Groupe @fr
label: E74 Grupo @pt
label: E74 Menschliche Gruppe @de
label: E74 Ομάδα @el
label: E74 Группа @ru
label: E74 团体 @zh
notation: E74
preferred label: Group
preferred label: Groupe @fr
preferred label: Grupo @pt
preferred label: Menschliche Gruppe @de
preferred label: Ομάδα @el
preferred label: Группа @ru
preferred label: 团体 @zh

E77 Persistent Item
type: Class
subclass of: E1 CRM Entity
comment: Scope note: This class comprises items that have persistent characteristics of structural nature substantially related to their identity and their integrity, sometimes known as “endurants” in philosophy. Persistent Items may be physical entities, such as people, animals or things, conceptual entities such as ideas, concepts, products of the imagination or even names. Instances of E77 Persistent Item may be present or be part of interactions in different periods or events. They can repeatedly be recognized at disparate occasions during their existence by characteristics of structural nature. The respective characteristics need not be exactly the same during all the existence of an instance of E77 Persistent Item. Often, they undergo gradual change, still bearing some similarities with that of previous times, or disappear completely and new emerge. For instance, a person, from the time of being born on, will gradually change all its features and acquire new ones, such as a scar. Even the DNA in different body cells will develop defects and mutations. Nevertheless, relevant characteristics used should be sufficiently similar to recognize the instance for some substantial period of time. The more specific criteria that determine the identity of instances of subclasses of E77 Persistent Item may vary considerably and are described or referred to in the respective scope notes. The decision about which exact criteria to use depends on whether the observable behaviour of the respective part of reality such confined conforms to the reasoning the user is interested in. For example, a building can be regarded as no longer existing if it is dismantled and the materials reused in a different configuration. On the other hand, human beings go through radical and profound changes during their life-span, affecting both material composition and form, yet preserve their identity by other criteria, such as being bodily separated from other persons. Similarly, inanimate objects may be s…
label: E77 Entidade Persistente @pt
label: E77 Entité persistante @fr
label: E77 Seiendes @de
label: E77 Ον @el
label: E77 Постоянная Сущность @ru
label: E77 持久项 @zh
notation: E77
preferred label: Entidade Persistente @pt
preferred label: Entité persistante @fr
preferred label: Persistent Item
preferred label: Seiendes @de
preferred label: Ον @el
preferred label: Постоянная Сущность @ru
preferred label: 持久项 @zh

E78 Curated Holding
type: Class
subclass of: E24 Physical Human-Made Thing
comment: Scope note: This class comprises aggregations of instances of E18 Physical Thing that are assembled and maintained (“curated” and “preserved,” in museological terminology) by one or more instances of E39 Actor over time for a specific purpose and audience, and according to a particular collection development plan. Typical instances of curated holdings are museum collections, archives, library holdings and digital libraries. A digital library is regarded as an instance of E18 Physical Thing because it requires keeping physical carriers of the electronic content. Items may be added or removed from an E78 Curated Holding in pursuit of this plan. This class should not be confused with the E39 Actor maintaining the E78 Curated Holding who is often referred to using the name of the E78 Curated Holding (e.g. “The Wallace Collection decided…”). Collective objects in the general sense, like a tomb full of gifts, a folder with stamps, or a set of chessmen, should be documented as instances of E19 Physical Object, and not as instances of E78 Curated Holding. This is because they form wholes, either because they are physically bound together or because they are kept together for their functionality. Examples: - the John Clayton Herbarium (Blake, 1918), (Natural History Museum, 2021) - the Wallace Collection (Ingamells, 1990) - Mikael Heggelund Foslie’s coralline red algae Herbarium at the Museum of Natural History and Archaeology, Trondheim, Norway (Woelkerling et al., 2005) - the Digital Collections of the Munich DigitiZation Center (MDZ) accessible via https://www.digitale-sammlungen.de/ at least in January 2018. In First Order Logic: - E78(x) ⇒ E24(x)
label: E78 Collection @fr
label: E78 Отвeтствeнноe Хранeниe @ru
notation: E78
preferred label: Collection @fr
preferred label: Curated Holding
preferred label: Отвeтствeнноe Хранeниe @ru

E7 Activity
type: Class
subclass of: E5 Event
comment: Scope note: This class comprises actions intentionally carried out by instances of E39 Actor that result in changes of state in the cultural, social, or physical systems documented. This notion includes complex, composite, and long-lasting actions such as the building of a settlement or a war, as well as simple, short-lived actions such as the opening of a door. Examples: - the Battle of Stalingrad (Hoyt, 1993) - the Yalta Conference (Harbutt, 2010) - my birthday celebration 28-6-1995 - the writing of “Faust” by Goethe (E65) (Williams, 2020) - the formation of the Bauhaus 1919 (E66) (Droste, 2006) - the people of Iraq giving the name ‘Quyunjig’ to the place identified by the TGN as ‘7017998’ - Kira Weber working in glass art from 1984 to 1993 - Kira Weber working in oil and pastel painting from 1993 In First Order Logic: - E7(x) ⇒ E5(x)
label: E7 Activité @fr
label: E7 Atividade @pt
label: E7 Handlung @de
label: E7 Δράση @el
label: E7 Дeятeльность @ru
label: E7 活动 @zh
notation: E7
preferred label: Activity
preferred label: Activité @fr
preferred label: Atividade @pt
preferred label: Handlung @de
preferred label: Δράση @el
preferred label: Дeятeльность @ru
preferred label: 活动 @zh

E89 Propositional Object
type: Class
subclass of: E28 Conceptual Object
comment: Scope note: This class comprises immaterial items, including but not limited to stories, plots, procedural prescriptions, algorithms, laws of physics or images that are, or represent in some sense, sets of propositions about real or imaginary things and that are documented as single units or serve as topic of discourse. This class also comprises items that are “about” something in the sense of a subject. In the wider sense, this class includes expressions of psychological value such as non-figural art and musical themes. However, conceptual items such as types and classes are not instances of E89 Propositional Object. This should not be confused with the definition of a type, which is indeed an instance of E89 Propositional Object. Examples: - Maxwell’s Equations (Ball, 1962) - the ideational contents of Aristotle’s book entitled ‘Metaphysics’ as rendered in the Greek texts translated in Oxford edition - the underlying prototype of any “no-smoking” sign (E36) - the common ideas of the plots of the movie “The Seven Samurai” by Akira Kurosawa and the movie “The Magnificent Seven” by John Sturges (Mellen, 2002) - the image content of the photo of the Allied Leaders at Yalta published by UPI, 1945 (E36) - the character “Little Red Riding Hood”, variants of which appear amongst others in Grimm brothers’ “Rotkäppchen”, other oral fairy tales and the film “Hoodwinked” - the place “Havnor” as invented by Ursula K. Le Guin for her “Earthsea” book series, the related maps and appearing in derivative works based on these novels In First Order Logic: - E89(x) ⇒ E28(x)
label: E89 Aussagenobjekt @de
label: E89 Objet propositionnel @fr
label: E89 Пропозициональный Объeкт @ru
label: E89 命题对象 @zh
notation: E89
preferred label: Aussagenobjekt @de
preferred label: Objet propositionnel @fr
preferred label: Propositional Object
preferred label: Пропозициональный Объeкт @ru
preferred label: 命题对象 @zh

E90 Symbolic Object
type: Class
subclass of: E28 Conceptual Object
subclass of: E72 Legal Object
comment: Scope note: This class comprises identifiable symbols and any aggregation of symbols, such as characters, identifiers, traffic signs, emblems, texts, data sets, images, musical scores, multimedia objects, computer program code, or mathematical formulae that have an objectively recognizable structure and that are documented as single units. It includes sets of signs of any nature, which may serve to designate something, or to communicate some propositional content. An instance of E90 Symbolic Object may or may not have a specific meaning, for example an arbitrary character string. In some cases, the content of an instance of E90 Symbolic Object may completely be represented by a serialized digital content model, such as a sequence of ASCII-encoded characters, an XML or HTML document, or a TIFF image. The property P3 has note and its subproperty P190 has symbolic content allow for the description of this content model. In order to disambiguate which symbolic level is the carrier of the meaning, the property P3.1 has type can be used to specify the encoding (e.g. “bit”, “Latin character”, RGB pixel). Examples: - ‘ecognizabl’ - the “no-smoking” sign (E36) - “BM000038850.JPG” (E41) [identifies a digital image] (Natural History Museum, 2021) - image BM000038850.JPG from the Clayton Herbarium in London (E36) [depicts specimen of Verbesina virginica] (Natural History Museum, 2021) - the distribution of form, tone and colour found on Leonardo da Vinci’s painting named “Mona Lisa” in daylight (E36) - the Italian text of Dante’s “Divina Commedia” as found in the authoritative critical edition “La Commedia secondo l’antica vulgata a cura di Giorgio Petrocchi” (E33) (Petrocchi, 1967) In First Order Logic: - E90(x) ⇒ E28(x) - E90(x) ⇒ E72(x)
label: E90 Objet symbolique @fr
label: E90 Symbolisches Objekt @de
label: E90 Символичeский Объeкт @ru
label: E90 符号对象 @zh
notation: E90
preferred label: Objet symbolique @fr
preferred label: Symbolic Object
preferred label: Symbolisches Objekt @de
preferred label: Символичeский Объeкт @ru
preferred label: 符号对象 @zh

E92 Spacetime Volume
type: Class
subclass of: E1 CRM Entity
comment: Scope note: This class comprises 4-dimensional point sets (volumes) in physical spacetime (in contrast to mathematical models of it) regardless of their true geometric forms. They may derive their identity from being the extent of a material phenomenon or from being the interpretation of an expression defining an extent in spacetime. Intersections of instances of E92 Spacetime Volume, E53 Place, and E52 Time-Span are also regarded as instances of E92 Spacetime Volume. An instance of E92 Spacetime Volume is either contiguous or composed of a finite number of contiguous subsets. Its boundaries may be fuzzy due to the properties of the phenomena it derives from or due to the limited precision up to which defining expression can be identified with a real extent in spacetime. The duration of existence of an instance of E92 Spacetime Volume is its projection on time. Examples: - the extent in space and time of the Event of Caesar’s murder (Irwin, 1935) - where and when the carbon 14 dating of the “Schoeninger Speer II” in 1996 took place (Kouwenhoven, 1997) - the spatio-temporal trajectory of the H.M.S. Victory from its building to its actual location (Goodwin, 2015) - the extent in space and time defined by a polygon approximating the Danube river flood in Austria between 6(th) and 9(th) August 2002 In First Order Logic: - E92(x) ⇒ E1(x)
label: E92 Volume spatio-temporel @fr
label: E92 Область Пространства-Врeмeни @ru
notation: E92
preferred label: Spacetime Volume
preferred label: Volume spatio-temporel @fr
preferred label: Область Пространства-Врeмeни @ru

Action
type: Class
subclass of: Action
type: NamedIndividual
type: Concept
definition: An operation on an Asset.
note: Actions may be allowed by Permissions, disallowed by Prohibitions, or made mandatory by Duties.

Agreement
type: Class
subclass of: Policy
disjoint with: Assertion
disjoint with: Offer
disjoint with: Privacy Policy
disjoint with: Request
disjoint with: Set
disjoint with: Ticket
type: NamedIndividual
type: Concept
definition: A Policy that grants the assignee a Rule over an Asset from an assigner.
note: An Agreement Policy MUST contain at least one Permission or Prohibition rule, a Party with Assigner function, and a Party with Assignee function (in the same Permission or Prohibition). The Agreement Policy will grant the terms of the Policy from the Assigner to the Assignee.

Assertion
type: Class
subclass of: Policy
disjoint with: Offer
disjoint with: Privacy Policy
disjoint with: Request
disjoint with: Set
disjoint with: Ticket
type: NamedIndividual
type: Concept
definition: A Policy that asserts a Rule over an Asset from parties.
note: For example, a party (an assignee or assigner) can claim what terms they have over an Asset. An Assertion Policy does not grant such permissions/prohibitions but only asserts the parties claims. An Assetion Policy MUST contain a target Asset, a Party with any functional role, and at least one of a Permission or Prohibition rule.
scope note: Non-Normative

Asset
type: Class
subclass of: E72 Legal Object
type: NamedIndividual
type: Concept
definition: A resource or a collection of resources that are the subject of a Rule.
note: The Asset entity can be any form of identifiable resource, such as data/information, content/media, applications, or services. Furthermore, it can be used to represent other Asset entities that are needed to undertake the Policy expression, such as with the Duty entity. To describe more details about the Asset, it is recommended to use Dublin Core dcterms elements or other content metadata.

Asset Collection
type: Class
subclass of: Asset
type: NamedIndividual
type: Concept
definition: An Asset that is collection of individual resources

Conflict Strategy Preference
type: Class
type: NamedIndividual
type: Concept
definition: Used to establish strategies to resolve conflicts that arise from the merging of Policies or conflicts between Permissions and Prohibitions in the same Policy.
note: Instances of ConflictTerm describe strategies for resolving conflicts.

Constraint
type: Class
type: NamedIndividual
type: Concept
definition: A boolean expression that refines the semantics of an Action and Party/Asset Collection or declare the conditions applicable to a Rule.

Duty
type: Class
subclass of: Rule
disjoint with: Permission
disjoint with: Prohibition
type: NamedIndividual
type: Concept
definition: The obligation to perform an Action

Left Operand
type: Class
type: NamedIndividual
type: Concept
definition: Left operand for a constraint expression.
note: Instances of the LeftOperand class are used as the leftOperand of a Constraint.

Logical Constraint
type: Class
type: NamedIndividual
type: Concept
definition: A logical expression that refines the semantics of an Action and Party/Asset Collection or declare the conditions applicable to a Rule.

Offer
type: Class
subclass of: Policy
disjoint with: Privacy Policy
disjoint with: Request
disjoint with: Set
disjoint with: Ticket
type: NamedIndividual
type: Concept
definition: A Policy that proposes a Rule over an Asset from an assigner.
note: An Offer Policy MUST contain at least one Permission or Prohibition rule and a Party with Assigner function (in the same Permission or Prohibition). The Offer Policy MAY contain a Party with Assignee function, but MUST not grant any privileges to that Party.

Operator
type: Class
type: NamedIndividual
type: Concept
definition: Operator for constraint expression.
note: Instances of the Operator class representing relational operators.

Party
type: Class
subclass of: E39 Actor
subclass of: Class
  union of: Organization
  union of: Person
  union of: Agent
  union of: Individual
type: NamedIndividual
type: Concept
definition: An entity or a collection of entities that undertake Roles in a Rule.
note: The Party entity could be a person, group of people, organisation, or agent. An agent is a person or thing that takes an active role or produces a specified effect. To describe more details about the Party, it is recommended to use W3C vCard Ontology vcard-rdf or FOAF Vocabulary foaf.

Party Collection
type: Class
subclass of: Party
type: NamedIndividual
type: Concept
definition: A Party that is a group of individual entities

Party Scope
type: Class
type: NamedIndividual
type: Concept
deprecated: true
definition: Scopes for Party Scope expressions.
note: Instances of the PartyScope class represent the terms for the scope property of Parties.

Permission
type: Class
subclass of: Rule
disjoint with: Prohibition
type: NamedIndividual
type: Concept
definition: The ability to perform an Action over an Asset.

Policy
type: Class
type: NamedIndividual
type: Concept
definition: A non-empty group of Permissions and/or Prohibitions.
note: A Policy may contain multiple Rules.

Privacy Policy
type: Class
subclass of: Policy
disjoint with: Request
disjoint with: Set
disjoint with: Ticket
type: NamedIndividual
type: Concept
definition: A Policy that expresses a Rule over an Asset containing personal information.
note: A Privacy Policy MUST contain a target Asset, a Party with Assigner is, a Party with Assignee function, and at least one of a Permission or Prohibition rule that MUST include a Duty. The target Asset SHOULD contain or relate to personal information about the Assignee. The Duty MUST describe obligations on the Assigner about managing the Asset. The Assignee is being granted the terms of the Privacy policy from the Assigner.
scope note: Non-Normative

Prohibition
type: Class
subclass of: Rule
type: NamedIndividual
type: Concept
definition: The inability to perform an Action over an Asset.

Request
type: Class
subclass of: Policy
disjoint with: Set
disjoint with: Ticket
type: NamedIndividual
type: Concept
definition: A Policy that proposes a Rule over an Asset from an assignee.
note: A Request Policy MUST contain a target Asset, a Party with Assignee function, and at least one of a Permission or Prohibition rule. The Request MAY also contain the Party with Assigner function if this is known. No privileges are granted to any Party.
scope note: Non-Normative

Right Operand
type: Class
type: NamedIndividual
type: Concept
definition: Right operand for constraint expression.
note: Instances of the RightOperand class are used as the rightOperand of a Constraint.

Rule
type: Class
type: NamedIndividual
type: Concept
definition: An abstract concept that represents the common characteristics of Permissions, Prohibitions, and Duties.
note: Rule is an abstract concept.

Set
type: Class
subclass of: Policy
disjoint with: Ticket
type: NamedIndividual
type: Concept
definition: A Policy that expresses a Rule over an Asset.
note: A Set Policy MUST contain a target Asset, and at least one Rule. A Set Policy is the default Policy subclass. The Set is aimed at scenarios where there is an open criteria for the semantics of the policy expressions and typically refined by other systems/profiles that process the information at a later time. No privileges are granted to any Party (if defined).

Ticket
type: Class
subclass of: Policy
type: NamedIndividual
type: Concept
definition: A Policy that grants the holder a Rule over an Asset from an assigner.
note: A Ticket Policy MUST contain a target Asset and at least one of a Permission or Prohibition rule. The Ticket MAY contain the Party with Assigner function and MUST NOT contain an Assignee. The Ticket Policy will grant the terms of the Policy to the holder of that Ticket. The holder of the Ticket MAY remain unknown or MAY have to be identified at some later stage.
scope note: Non-Normative

Undefined Term
type: Class
type: NamedIndividual
type: Concept
deprecated: true
definition: Is used to indicate how to support Actions that are not part of any vocabulary or profile in the policy expression system.
note: Instances of UndefinedTerm describe strategies for processing unsupported actions.

Agent
type: Class
comment: An agent (eg. person, group, software or physical artifact).
term status: stable

Document
type: Class
comment: A document.
term status: stable

AdministrativeArea
type: Class
subclass of: Place
comment: A geographical region, typically under the jurisdiction of a particular government.

Class
subclass of: Intangible
comment: A class, also often called a 'Type'; equivalent to rdfs:Class.

Country
type: Class
subclass of: AdministrativeArea
comment: A country.

CreativeWork
type: Class
subclass of: Thing
comment: The most generic kind of creative work, including books, movies, photographs, software programs, etc.

DataType
type: Class
subclass of: Class
comment: The basic data types such as Integers, Strings, etc.

Enumeration
type: Class
subclass of: Intangible
comment: Lists or enumerations—for example, a list of cuisines or music genres, etc.

Intangible
type: Class
subclass of: Thing
comment: A utility class that serves as the umbrella for a number of 'intangible' things such as quantities, structured values, etc.

MediaObject
type: Class
subclass of: CreativeWork
comment: A media object, such as an image, video, audio, or text object embedded in a web page or a downloadable dataset i.e. DataDownload. Note that a creative work may have many media objects associated with it on the same web page. For example, a page about a single song (MusicRecording) may have a music video (VideoObject), and a high and low bandwidth audio stream (2 AudioObject's).

Person
type: Class
subclass of: Thing
comment: A person (alive, dead, undead, or fictional).

Place
type: Class
subclass of: Thing
comment: Entities that have a somewhat fixed, physical extension.

Property
type: Class
subclass of: Intangible
comment: A property, used to indicate attributes and relationships of some Thing; equivalent to rdf:Property.

Role
type: Class
subclass of: Intangible
comment: Represents additional information about a relationship or property. For example a Role can be used to say that a 'member' role linking some SportsTeam to a player occurred during a particular time period. Or that a Person's 'actor' role in a Movie was for some particular characterName. Such properties can be attached to a Role entity, which is then associated with the main entities using ordinary properties like 'member' or 'actor'. See also blog post.

Specialty
type: Class
subclass of: Enumeration
comment: Any branch of a field in which people typically develop specific expertise, usually after significant study, time, and effort.

Text
type: Class
subclass of: DataType
comment: Data type: Text.

TextObject
type: Class
subclass of: MediaObject
comment: A text file. The text can be unformatted or contain markup, html, etc.

Thing
type: Class
comment: The most generic type of item.

URL
type: Class
subclass of: Text
comment: Data type: URL.

WebPage
type: Class
subclass of: CreativeWork
comment: A web page. Every web page is implicitly assumed to be declared to be of type WebPage, so the various properties about that webpage, such as breadcrumb may be used. We recommend explicit declaration if these properties are specified, but if they are found outside of an itemscope, they will be assumed to be about the page.

Attribution
type: NamedIndividual
type: Concept
type: Action
Included In: Use
definition: Credit be given to copyright holder and/or author.
note: This term is defined by Creative Commons.
scope note: Non-Normative

Commercial Use
type: NamedIndividual
type: Concept
type: Action
Included In: Use
definition: Exercising rights for commercial purposes.
note: This term is defined by Creative Commons.
scope note: Non-Normative

Derivative Works
type: NamedIndividual
type: Concept
type: Action
Included In: Use
definition: Distribution of derivative works.
note: This term is defined by Creative Commons.
scope note: Non-Normative

Distribution
type: NamedIndividual
type: Concept
type: Action
Included In: Use
definition: Distribution, public display, and publicly performance.
note: This term is defined by Creative Commons.
scope note: Non-Normative

Notice
type: NamedIndividual
type: Concept
type: Action
Included In: Use
definition: Copyright and license notices be kept intact.
note: This term is defined by Creative Commons.
scope note: Non-Normative

Reproduction
type: NamedIndividual
type: Concept
type: Action
Included In: Use
definition: Making multiple copies.
note: This term is defined by Creative Commons.
scope note: Non-Normative

Share Alike
type: NamedIndividual
type: Concept
type: Action
Included In: Use
definition: Derivative works be licensed under the same terms or compatible terms as the original work.
note: This term is defined by Creative Commons.
scope note: Non-Normative

Sharing
type: NamedIndividual
type: Concept
type: Action
Included In: Use
definition: Permits commercial derivatives, but only non-commercial distribution.
note: This term is defined by Creative Commons.
scope note: Non-Normative

Source Code
type: NamedIndividual
type: Concept
type: Action
Included In: Use
definition: Source code (the preferred form for making modifications) must be provided when exercising some rights granted by the license.
note: This term is defined by Creative Commons.
scope note: Non-Normative

All
type: NamedIndividual
type: Concept
type: Party Scope
deprecated: true
definition: Specifies that the scope of the relationship is all of the collective individuals within a context.
note: For example, may be used to indicate all the users of a specific social network the party is a member of. Note that “group” scope is also assumed.
scope note: Non-Normative

All Second-level Connections
type: NamedIndividual
type: Concept
type: Party Scope
deprecated: true
definition: Specifies that the scope of the relationship is all of the second-level connections to the Party.
note: For example, may be used to indicate all “friends of friends” of the Party. Note that “group” scope is also assumed.
scope note: Non-Normative

All First-Level Connections
type: NamedIndividual
type: Concept
type: Party Scope
deprecated: true
definition: Specifies that the scope of the relationship is all of the first-level connections of the Party.
note: For example, may be used to indicate all “friends” of the Party. Note that “group” scope is also assumed.
scope note: Non-Normative

All Group Connections
type: NamedIndividual
type: Concept
type: Party Scope
deprecated: true
definition: Specifies that the scope of the relationship is all of the group connections of the Party.
note: For example, may be used to indicate all groups that the Party is a member of. Note that “group” scope is also assumed.
scope note: Non-Normative

Asset Scope
type: NamedIndividual
type: Concept
deprecated: true
definition: Scopes for Asset Scope expressions.
note: Instances of the AssetScope class represent the terms for the scope property of Assets.

Group
type: NamedIndividual
type: Concept
type: Party Scope
deprecated: true
definition: Specifies that the scope of the relationship is the defined group with multiple individual members.
scope note: Non-Normative

Individual
type: NamedIndividual
type: Concept
type: Party Scope
deprecated: true
definition: Specifies that the scope of the relationship is the single Party individual.

Absolute Asset Position
type: NamedIndividual
type: Concept
type: Left Operand
definition: A point in space or time defined with absolute coordinates for the positioning of the target Asset.
note: Example: The upper left corner of a picture may be constrained to a specific position of the canvas rendering it.
scope note: Non-Normative

Absolute Asset Size
type: NamedIndividual
type: Concept
type: Left Operand
definition: Measure(s) of one or two axes for 2D-objects or measure(s) of one to tree axes for 3D-objects of the target Asset.
note: Example: The image can be resized in width to a maximum of 1000px.
scope note: Non-Normative

Absolute Spatial Asset Position
type: NamedIndividual
type: Concept
type: Left Operand
broader: Absolute Asset Position
definition: The absolute spatial positions of four corners of a rectangle on a 2D-canvas or the eight corners of a cuboid in a 3D-space for the target Asset to fit.
note: Example: The upper left corner of a picture may be constrained to a specific position of the canvas rendering it. Note: see also the Left Operand Relative Spatial Asset Position.
scope note: Non-Normative

Absolute Temporal Asset Position
type: NamedIndividual
type: Concept
type: Left Operand
broader: Absolute Asset Position
definition: The absolute temporal positions in a media stream the target Asset has to fit.
note: Use with Actions including the target Asset in a larger media stream. The fragment part of a Media Fragment URI (https://www.w3.org/TR/media-frags/) may be used for the right operand. See the Left Operand realativeTemporalPosition. Example: The MP3 music file must be positioned between second 192 and 250 of the temporal length of a stream.
scope note: Non-Normative

Accept Tracking
type: NamedIndividual
type: Concept
type: Action
Included In: Use
definition: To accept that the use of the Asset may be tracked.
note: The collected information may be tracked by the Assigner, or may link to a Party with the role 'trackingParty' function.
scope note: Non-Normative

Ad-hoc sharing
type: NamedIndividual
type: Concept
type: Action
deprecated: true
definition: The act of sharing the asset to parties in close proximity to the owner.
note: This original term and URI from the OMA specification should be used: http://www.openmobilealliance.com/oma-dd/adhoc-share .

Aggregate
type: NamedIndividual
type: Concept
type: Action
Included In: Use
definition: To use the Asset or parts of it as part of a composite collection.
scope note: Non-Normative

Annotate
type: NamedIndividual
type: Concept
type: Action
Included In: Use
definition: To add explanatory notations/commentaries to the Asset without modifying the Asset in any other way.
scope note: Non-Normative

Anonymize
type: NamedIndividual
type: Concept
type: Action
Included In: Use
definition: To anonymize all or parts of the Asset.
note: For example, to remove identifying particulars for statistical or for other comparable purposes, or to use the Asset without stating the author/source.
scope note: Non-Normative

Append
type: NamedIndividual
type: Concept
type: Action
deprecated: true
definition: The act of adding to the end of an asset.

Append To
type: NamedIndividual
type: Concept
type: Action
deprecated: true
definition: The act of appending data to the Asset without modifying the Asset in any other way.

Archive
type: NamedIndividual
type: Concept
type: Action
Included In: Use
definition: To store the Asset (in a non-transient form).
note: Temporal constraints may be used for temporal conditions.
scope note: Non-Normative

Attach policy
type: NamedIndividual
type: Concept
type: Action
deprecated: true
definition: The act of keeping the policy notice with the asset.

Attach source
type: NamedIndividual
type: Concept
type: Action
deprecated: true
definition: The act of attaching the source of the asset and its derivatives.

Attribute
type: NamedIndividual
type: Concept
type: Action
Included In: Use
definition: To attribute the use of the Asset.
note: May link to an Asset with the attribution information. May link to a Party with the role “attributedParty” function.
scope note: Non-Normative

Commercialize
type: NamedIndividual
type: Concept
type: Action
deprecated: true
definition: The act of using the asset in a business environment.

Compensate
type: NamedIndividual
type: Concept
type: Action
Included In: Use
definition: To compensate by transfer of some amount of value, if defined, for using or selling the Asset.
note: The compensation may use different types of things with a value: (i) the thing is expressed by the value (term) of the Constraint name; (b) the value is expressed by operator, rightOperand, dataType and unit. Typically the assignee will compensate the assigner, but other compensation party roles may be used.
scope note: Non-Normative

Concurrent Use
type: NamedIndividual
type: Concept
type: Action
Included In: Use
definition: To create multiple copies of the Asset that are being concurrently used.
scope note: Non-Normative

Copy
type: NamedIndividual
type: Concept
type: Action
deprecated: true
definition: The act of making an exact reproduction of the asset.

ODRL Core Profile
type: NamedIndividual
type: Concept
definition: Identifier for the ODRL Core Profile

Count
type: NamedIndividual
type: Concept
type: Left Operand
definition: Numeric count of executions of the action of the Rule.
scope note: Non-Normative

Datetime
type: NamedIndividual
type: Concept
type: Left Operand
definition: The date (and optional time and timezone) of exercising the action of the Rule. Right operand value MUST be an xsd:date or xsd:dateTime as defined by xmlschema11-2.
note: The use of Timezone information is strongly recommended. The Rule may be exercised before (with operator lt/lteq) or after (with operator gt/gteq) the date(time) defined by the Right operand. Example: dateTime gteq 2017-12-31T06:00Z means the Rule can only be exercised after (and including) 6:00AM on the 31st Decemeber 2017 UTC time.
scope note: Non-Normative

Delay Period
type: NamedIndividual
type: Concept
type: Left Operand
definition: A time delay period prior to exercising the action of the Rule. The point in time triggering this period MAY be defined by another temporal Constraint combined by a Logical Constraint (utilising the odrl:andSequence operand). Right operand value MUST be an xsd:duration as defined by xmlschema11-2.
note: Only the eq, gt, gteq operators SHOULD be used. Example: delayPeriod eq P60M indicates a delay of 60 Minutes before exercising the action.
scope note: Non-Normative

Delete
type: NamedIndividual
type: Concept
type: Action
Included In: Use
definition: To permanently remove all copies of the Asset after it has been used.
note: Use a constraint to define under which conditions the Asset must be deleted.
scope note: Non-Normative

Delivery Channel
type: NamedIndividual
type: Concept
type: Left Operand
definition: The delivery channel used for exercising the action of the Rule.
note: Example: the asset may be distributed only on mobile networks.
scope note: Non-Normative

Derive
type: NamedIndividual
type: Concept
type: Action
Included In: Use
definition: To create a new derivative Asset from this Asset and to edit or modify the derivative.
note: A new asset is created and may have significant overlaps with the original Asset. (Note that the notion of whether or not the change is significant enough to qualify as a new asset is subjective). To the derived Asset a next policy may be applied.
scope note: Non-Normative

Device
type: NamedIndividual
type: Concept
type: Left Operand
deprecated: true
definition: An identified device used for exercising the action of the Rule.
note: See System Device.

Digitize
type: NamedIndividual
type: Concept
type: Action
Included In: Use
definition: To produce a digital copy of (or otherwise digitize) the Asset from its analogue form.
scope note: Non-Normative

Display
type: NamedIndividual
type: Concept
type: Action
Included In: Play
definition: To create a static and transient rendition of an Asset.
note: For example, displaying an image on a screen. If the action is to be performed to a wider audience than just the Assignees, then the Recipient constraint is recommended to be used.
scope note: Non-Normative

Distribute
type: NamedIndividual
type: Concept
type: Action
Included In: Use
definition: To supply the Asset to third-parties.
note: It is recommended to use nextPolicy to express the allowable usages by third-parties.
scope note: Non-Normative

Elapsed Time
type: NamedIndividual
type: Concept
type: Left Operand
definition: A continuous elapsed time period which may be used for exercising of the action of the Rule. Right operand value MUST be an xsd:duration as defined by xmlschema11-2.
note: Only the eq, lt, lteq operators SHOULD be used. See also Metered Time. Example: elpasedTime eq P60M indicates a total elapsed time of 60 Minutes.
scope note: Non-Normative

Ensure Exclusivity
type: NamedIndividual
type: Concept
type: Action
Included In: Use
definition: To ensure that the Rule on the Asset is exclusive.
note: If used as a Duty, the assignee should be explicitly indicated as the party that is ensuring the exclusivity of the Rule.
scope note: Non-Normative

Equal to
type: NamedIndividual
type: Concept
type: Operator
definition: Indicating that a given value equals the right operand of the Constraint.

Event
type: NamedIndividual
type: Concept
type: Left Operand
definition: An identified event setting a context for exercising the action of the Rule.
note: Events are temporal periods of time, and operators can be used to signal before (lt), during (eq) or after (gt) the event. Example: May be taken during the “FIFA World Cup 2020” only.
scope note: Non-Normative

Execute
type: NamedIndividual
type: Concept
type: Action
Included In: Use
definition: To run the computer program Asset.
note: For example, machine executable code or Java such as a game or application.
scope note: Non-Normative

Export
type: NamedIndividual
type: Concept
type: Action
deprecated: true
definition: The act of transforming the asset into a new form.

Extract
type: NamedIndividual
type: Concept
type: Action
Included In: Reproduce
definition: To extract parts of the Asset and to use it as a new Asset.
note: A new asset is created and may have very little in common with the original Asset. (Note that the notion of whether or not the change is significant enough to qualify as a new asset is subjective). To the extracted Asset a next policy may be applied.
scope note: Non-Normative

Extract character
type: NamedIndividual
type: Concept
type: Action
deprecated: true
definition: The act of extracting (replicating) unchanged characters from the asset.
note: This original term and URI from the ONIX specification should be used: http://www.editeur.org/onix-pl/extract-char .

Extract page
type: NamedIndividual
type: Concept
type: Action
deprecated: true
definition: The act of extracting (replicating) unchanged pages from the asset.
note: This original term and URI from the ONIX specification should be used: http://www.editeur.org/onix-pl/extract-page .

Extract word
type: NamedIndividual
type: Concept
type: Action
deprecated: true
definition: The act of extracting (replicating) unchanged words from the asset.
note: This original term and URI from the ONIX specification should be used: http://www.editeur.org/onix-pl/extract-word .

File Format
type: NamedIndividual
type: Concept
type: Left Operand
definition: A transformed file format of the target Asset.
note: Example: An asset may be transformed into JPEG format.
scope note: Non-Normative

Give
type: NamedIndividual
type: Concept
type: Action
Included In: Transfer Ownership
definition: To transfer the ownership of the Asset to a third party without compensation and while deleting the original asset.
scope note: Non-Normative

Grant Use
type: NamedIndividual
type: Concept
type: Action
Included In: Use
definition: To grant the use of the Asset to third parties.
note: This action enables the assignee to create policies for the use of the Asset for third parties. The nextPolicy is recommended to be agreed with the third party. Use of temporal constraints is recommended.
scope note: Non-Normative

Greater than
type: NamedIndividual
type: Concept
type: Operator
definition: Indicating that a given value is greater than the right operand of the Constraint.

Greater than or equal to
type: NamedIndividual
type: Concept
type: Operator
definition: Indicating that a given value is greater than or equal to the right operand of the Constraint.

Has part
type: NamedIndividual
type: Concept
type: Operator
definition: A set-based operator indicating that a given value contains the right operand of the Constraint.

Ignore Undefined Actions
type: NamedIndividual
type: Concept
type: Undefined Term
deprecated: true
definition: The Action is to be ignored and is not part of the policy – and the policy remains valid.
note: Used to support actions not known to the policy system.

Include
type: NamedIndividual
type: Concept
type: Action
Included In: Use
definition: To include other related assets in the Asset.
note: For example: bio picture must be included in the attribution. Use of a relation sub-property is required for the related assets.
scope note: Non-Normative

Index
type: NamedIndividual
type: Concept
type: Action
Included In: Use
definition: To record the Asset in an index.
note: For example, to include a link to the Asset in a search engine database.
scope note: Non-Normative

Industry Context
type: NamedIndividual
type: Concept
type: Left Operand
definition: A defined industry sector setting a context for exercising the action of the Rule.
note: Example: publishing or financial industry.
scope note: Non-Normative

Inform
type: NamedIndividual
type: Concept
type: Action
Included In: Use
definition: To inform that an action has been performed on or in relation to the Asset.
note: May link to a Party with the role 'informedParty' function.
scope note: Non-Normative

Informing Party
type: NamedIndividual
type: Concept
definition: The Party who provides the inform use data.
note: Maybe specified as part of the inform action.
scope note: Non-Normative

Inheritance Allowed
type: NamedIndividual
type: Concept
deprecated: true
definition: Indicates if the Policy entity can be inherited.
note: A boolean value.

Inherit Relation
type: NamedIndividual
type: Concept
deprecated: true
definition: Indentifies the type of inheritance.
note: For example, this may indicate the business scenario, such as subscription, or prior arrangements between the parties (that are not machine representable).

Install
type: NamedIndividual
type: Concept
type: Action
Included In: Use
definition: To load the computer program Asset onto a storage device which allows operating or running the Asset.
scope note: Non-Normative

Void Policy
type: NamedIndividual
type: Concept
type: Conflict Strategy Preference
definition: The policy is void.
note: Used to indicate the policy is void for Conflict Strategy.
scope note: Non-Normative

Is a
type: NamedIndividual
type: Concept
type: Operator
definition: A set-based operator indicating that a given value is an instance of the right operand of the Constraint.

Is all of
type: NamedIndividual
type: Concept
type: Operator
definition: A set-based operator indicating that a given value is all of the right operand of the Constraint.

Is any of
type: NamedIndividual
type: Concept
type: Operator
definition: A set-based operator indicating that a given value is any of the right operand of the Constraint.

Is none of
type: NamedIndividual
type: Concept
type: Operator
definition: A set-based operator indicating that a given value is none of the right operand of the Constraint.

Is part of
type: NamedIndividual
type: Concept
type: Operator
definition: A set-based operator indicating that a given value is contained by the right operand of the Constraint.

Language
type: NamedIndividual
type: Concept
type: Left Operand
definition: A natural language used by the target Asset.
note: Example: the asset can only be translated into Greek. Must use bcp47 codes for language values.
scope note: Non-Normative

Lease
type: NamedIndividual
type: Concept
type: Action
deprecated: true
definition: The act of making available the asset to a third-party for a fixed period of time with exchange of value.

Lend
type: NamedIndividual
type: Concept
type: Action
deprecated: true
definition: The act of making available the asset to a third-party for a fixed period of time without exchange of value.

License
type: NamedIndividual
type: Concept
type: Action
deprecated: true
definition: The act of granting the right to use the asset to a third-party.

Less than
type: NamedIndividual
type: Concept
type: Operator
definition: Indicating that a given value is less than the right operand of the Constraint.

Less than or equal to
type: NamedIndividual
type: Concept
type: Operator
definition: Indicating that a given value is less than or equal to the right operand of the Constraint.

Media Context
type: NamedIndividual
type: Concept
type: Left Operand
definition: Category of a media asset setting a context for exercising the action of the Rule.
note: Example media types: electronic, print, advertising, marketing. Note: The used type should not be an IANA MediaType as they are focused on technical characteristics.
scope note: Non-Normative

Metered Time
type: NamedIndividual
type: Concept
type: Left Operand
definition: An accumulated amount of one to many metered time periods which were used for exercising the action of the Rule. Right operand value MUST be an xsd:duration as defined by xmlschema11-2.
note: Only the eq, lt, lteq operators SHOULD be used. See also Elapsed Time. Example: meteredTime lteq P60M indicates an accumulated period of 60 Minutes or less.
scope note: Non-Normative

Modify
type: NamedIndividual
type: Concept
type: Action
Included In: Use
definition: To change existing content of the Asset. A new asset is not created by this action.
note: This action will modify an asset which is typically updated from time to time without creating a new asset. If the result from modifying the asset should be a new asset the actions derive or extract should be used. (Note that the notion of whether or not the change is significant enough to qualify as a new asset is subjective).
scope note: Non-Normative

Move
type: NamedIndividual
type: Concept
type: Action
Included In: Use
definition: To move the Asset from one digital location to another including deleting the original copy.
note: After the Asset has been moved, the original copy must be deleted.
scope note: Non-Normative

Not equal to
type: NamedIndividual
type: Concept
type: Operator
definition: Indicating that a given value is not equal to the right operand of the Constraint.

Next Policy
type: NamedIndividual
type: Concept
type: Action
Included In: Use
definition: To grant the specified Policy to a third party for their use of the Asset.
note: Useful for downstream policies.
scope note: Non-Normative

Obtain Consent
type: NamedIndividual
type: Concept
type: Action
Included In: Use
definition: To obtain verifiable consent to perform the requested action in relation to the Asset.
note: May be used as a Duty to ensure that the Assigner or a Party is authorized to approve such actions on a case-by-case basis. May link to a Party with the role “consentingParty” function.
scope note: Non-Normative

Pay
type: NamedIndividual
type: Concept
type: Action
deprecated: true
definition: The act of paying a financial amount to a party for use of the asset.

Payment Amount
type: NamedIndividual
type: Concept
type: Left Operand
definition: The amount of a financial payment. Right operand value MUST be an xsd:decimal.
note: Can be used for compensation duties with the unit property indicating the currency of the payment.
scope note: Non-Normative

Payee Party
type: NamedIndividual
type: Concept
deprecated: true
definition: The Party is the recipient of the payment.
scope note: Non-Normative

Asset Percentage
type: NamedIndividual
type: Concept
type: Left Operand
definition: A percentage amount of the target Asset relevant for exercising the action of the Rule. Right operand value MUST be an xsd:decimal from 0 to 100.
note: Example: Extract less than or equal to 50%.
scope note: Non-Normative

Prefer Permissions
type: NamedIndividual
type: Concept
type: Conflict Strategy Preference
definition: Permissions take preference over prohibitions.
note: Used to determine policy conflict outcomes.

Play
type: NamedIndividual
type: Concept
type: Action
Included In: Use
definition: To create a sequential and transient rendition of an Asset.
note: For example, to play a video or audio track. If the action is to be performed to a wider audience than just the Assignees, then the Recipient constraint is recommended to be used.
scope note: Non-Normative

Policy Rule Usage
type: NamedIndividual
type: Concept
type: Right Operand
definition: Indicates the actual datetime the action of the Rule was exercised.
note: This can be used to express constraints with a LeftOperand relative to the time the rule is exercised. Operators indicate before (lt, lteq), during (eq) or after (gt, gteq) the usage of the rule. Example: event lt policyUsage expresses that the identified event must have happened before the action of the rule is exercised.
scope note: Non-Normative

Present
type: NamedIndividual
type: Concept
type: Action
Included In: Use
definition: To publicly perform the Asset.
note: The asset can be performed (or communicated) in public.
scope note: Non-Normative

Preview
type: NamedIndividual
type: Concept
type: Action
deprecated: true
definition: The act of providing a short preview of the asset.
note: Use a time constraint with the appropriate action.

Print
type: NamedIndividual
type: Concept
type: Action
Included In: Use
definition: To create a tangible and permanent rendition of an Asset.
note: For example, creating a permanent, fixed (static), and directly perceivable representation of the Asset, such as printing onto paper.
scope note: Non-Normative

Product Context
type: NamedIndividual
type: Concept
type: Left Operand
definition: Category of product or service setting a context for exercising the action of the Rule.
note: Example: May only be used in the XYZ Magazine.
scope note: Non-Normative

Profile
type: NamedIndividual
type: Concept
definition: The identifier(s) of an ODRL Profile that the Policy conforms to.
note: The profile property is mandatory if the Policy is using an ODRL Profile.

Prefer Prohibitions
type: NamedIndividual
type: Concept
type: Conflict Strategy Preference
definition: Prohibitions take preference over permissions.
note: Used to determine policy conflict outcomes.

proximity
type: NamedIndividual
type: Concept
deprecated: true
definition: An value indicating the closeness or nearness.
note: This original term and URI from the OMA specification should be used: http://www.openmobilealliance.com/oma-dd/proximity .

Purpose
type: NamedIndividual
type: Concept
type: Left Operand
definition: A defined purpose for exercising the action of the Rule.
note: Example: Educational use.
scope note: Non-Normative

Read
type: NamedIndividual
type: Concept
type: Action
Included In: Use
definition: To obtain data from the Asset.
note: For example, the ability to read a record from a database (the Asset).
scope note: Non-Normative

Recipient
type: NamedIndividual
type: Concept
type: Left Operand
definition: The party receiving the result/outcome of exercising the action of the Rule.
note: The Right Operand must identify one or more specific Parties or category/ies of the Party.
scope note: Non-Normative

Relative Asset Position
type: NamedIndividual
type: Concept
type: Left Operand
definition: A point in space or time defined with coordinates relative to full measures the positioning of the target Asset.
note: Example: The upper left corner of a picture may be constrained to a specific position of the canvas rendering it.
scope note: Non-Normative

Relative Asset Size
type: NamedIndividual
type: Concept
type: Left Operand
definition: Measure(s) of one or two axes for 2D-objects or measure(s) of one to tree axes for 3D-objects - expressed as percentages of full values - of the target Asset.
note: Example: The image can be resized in width to a maximum of 200%. Note: See the Left Operand absoluteSize.
scope note: Non-Normative

Relative Spatial Asset Position
type: NamedIndividual
type: Concept
type: Left Operand
broader: Relative Asset Position
definition: The relative spatial positions - expressed as percentages of full values - of four corners of a rectangle on a 2D-canvas or the eight corners of a cuboid in a 3D-space of the target Asset.
note: See also Absolute Spatial Asset Position.
scope note: Non-Normative

Relative Temporal Asset Position
type: NamedIndividual
type: Concept
type: Left Operand
broader: Relative Asset Position
definition: A point in space or time defined with coordinates relative to full measures the positioning of the target Asset.
note: See also Absolute Temporal Asset Position. Example: The MP3 music file must be positioned between the positions at 33% and 48% of the temporal length of a stream.
scope note: Non-Normative

Reproduce
type: NamedIndividual
type: Concept
type: Action
Included In: Use
definition: To make duplicate copies the Asset in any material form.
scope note: Non-Normative

Rendition Resolution
type: NamedIndividual
type: Concept
type: Left Operand
definition: Resolution of the rendition of the target Asset.
note: Example: the image may be printed at 1200dpi.
scope note: Non-Normative

Review Policy
type: NamedIndividual
type: Concept
type: Action
Included In: Use
definition: To review the Policy applicable to the Asset.
note: Used when human intervention is required to review the Policy. May link to an Asset which represents the full Policy information.
scope note: Non-Normative

Has Right Operand Reference
type: NamedIndividual
type: Concept
definition: A reference to a web resource providing the value for the right operand of a Constraint.
note: An IRI that MUST be dereferenced to obtain the actual right operand value. When used with set-based operators, a list of IRIs may be used

Scope
type: NamedIndividual
type: Concept
deprecated: true
definition: The identifier of a scope that provides context to the extent of the entity.
note: Used to define scopes for Assets and Parties.

Secondary Use
type: NamedIndividual
type: Concept
type: Action
deprecated: true
definition: The act of using the asset for a purpose other than the purpose it was intended for.

Sell
type: NamedIndividual
type: Concept
type: Action
Included In: Transfer Ownership
definition: To transfer the ownership of the Asset to a third party with compensation and while deleting the original asset.
scope note: Non-Normative

Share
type: NamedIndividual
type: Concept
type: Action
deprecated: true
definition: The act of the non-commercial reproduction and distribution of the asset to third-parties.

Share-alike
type: NamedIndividual
type: Concept
type: Action
deprecated: true
definition: The act of distributing any derivative asset under the same terms as the original asset.

Source
type: NamedIndividual
type: Concept
definition: Reference to a Asset/PartyCollection
note: Used by AssetCollection and PartyCollection when constraints are applied.

Geospatial Named Area
type: NamedIndividual
type: Concept
type: Left Operand
definition: A named and identified geospatial area with defined borders which is used for exercising the action of the Rule. An IRI MUST be used to represent this value.
note: A code value for the area and source of the code must be presented in the Right Operand. Example: the iso3166 Country Codes or the Getty Thesaurus of Geographic Names.
scope note: Non-Normative

Geospatial Coordinates
type: NamedIndividual
type: Concept
type: Left Operand
broader: Geospatial Named Area
definition: A set of coordinates setting the borders of a geospatial area used for exercising the action of the Rule. The coordinates MUST include longitude and latitude, they MAY include altitude and the geodetic datum.
note: The default values are the altitude of earth's surface at this location and the WGS 84 datum.
scope note: Non-Normative

Status
type: NamedIndividual
type: Concept
definition: the value generated from the leftOperand action or a value related to the leftOperand set as the reference for the comparison.

Stream
type: NamedIndividual
type: Concept
type: Action
Included In: Use
definition: To deliver the Asset in real-time.
note: The Asset maybe utilised in real-time as it is being delivered. If the action is to be performed to a wider audience than just the Assignees, then the Recipient constraint is recommended to be used.
scope note: Non-Normative

Support Undefined Actions
type: NamedIndividual
type: Concept
type: Undefined Term
deprecated: true
definition: The Action is to be supported as part of the policy – and the policy remains valid.
note: Used to support actions not known to the policy system.

Synchronize
type: NamedIndividual
type: Concept
type: Action
Included In: Use
definition: To use the Asset in timed relations with media (audio/visual) elements of another Asset.
scope note: Non-Normative

System
type: NamedIndividual
type: Concept
type: Left Operand
deprecated: true
definition: An identified computing system used for exercising the action of the Rule.
note: See System Device

System Device
type: NamedIndividual
type: Concept
type: Left Operand
definition: An identified computing system or computing device used for exercising the action of the Rule.
note: Example: The system device can be identified by a unique code created from the used hardware.
scope note: Non-Normative

Text-to-speech
type: NamedIndividual
type: Concept
type: Action
Included In: Use
definition: To have a text Asset read out loud.
note: If the action is to be performed to a wider audience than just the Assignees, then the recipient constraint is recommended to be used.
scope note: Non-Normative

Recurring Time Interval
type: NamedIndividual
type: Concept
type: Left Operand
definition: A recurring period of time before the next execution of the action of the Rule. Right operand value MUST be an xsd:duration as defined by xmlschema11-2.
note: Only the eq operator SHOULD be used. Example: timeInterval eq P7D indicates a recurring 7 day period.
scope note: Non-Normative

Timed Count
type: NamedIndividual
type: Concept
deprecated: true
definition: The number of seconds after which timed metering use of the asset begins.
note: This original term and URI from the OMA specification should be used: http://www.openmobilealliance.com/oma-dd/timed-count .

Transfer Ownership
type: NamedIndividual
type: Concept
type: Action
definition: To transfer the ownership of the Asset in perpetuity.

Transform
type: NamedIndividual
type: Concept
type: Action
Included In: Use
definition: To convert the Asset into a different format.
note: Typically used to convert the Asset into a different format for consumption on/transfer to a third party system.
scope note: Non-Normative

Translate
type: NamedIndividual
type: Concept
type: Action
Included In: Use
definition: To translate the original natural language of an Asset into another natural language.
note: A new derivative Asset is created by that action.
scope note: Non-Normative

Unique Identifier
type: NamedIndividual
type: Concept
definition: An unambiguous identifier
note: Used by the Policy, Rule, Asset, Party, Constraint, and Logical Constraint Classes.

Handle Undefined Term
type: NamedIndividual
type: Concept
deprecated: true
definition: Relates the strategy used for handling undefined actions to a Policy.
note: If no strategy is specified, the default is invalid.

Uninstall
type: NamedIndividual
type: Concept
type: Action
Included In: Use
definition: To unload and delete the computer program Asset from a storage device and disable its readiness for operation.
note: The Asset is no longer accessible to the assignees after it has been used.
scope note: Non-Normative

Unit Of Count
type: NamedIndividual
type: Concept
type: Left Operand
definition: The unit of measure used for counting the executions of the action of the Rule.
note: Note: Typically used with Duties to indicate the unit entity to be counted of the Action. Example: A duty to compensate and a unitOfCount constraint of 'perUser' would indicate that the compensation by multiplied by the 'number of users'.
scope note: Non-Normative

Use
type: NamedIndividual
type: Concept
type: Action
definition: To use the Asset
note: Use is the most generic action for all non-third-party usage. More specific types of the use action can be expressed by more targetted actions.

Version
type: NamedIndividual
type: Concept
type: Left Operand
definition: The version of the target Asset.
note: Example: Single Paperback or Multiple Issues or version 2.0 or higher.
scope note: Non-Normative

Virtual IT Communication Location
type: NamedIndividual
type: Concept
type: Left Operand
definition: An identified location of the IT communication space which is relevant for exercising the action of the Rule.
note: Example: an Internet domain or IP address range.
scope note: Non-Normative

Watermark
type: NamedIndividual
type: Concept
type: Action
Included In: Use
definition: To apply a watermark to the Asset.
scope note: Non-Normative

Write
type: NamedIndividual
type: Concept
type: Action
deprecated: true
definition: The act of writing to the Asset.

Write to
type: NamedIndividual
type: Concept
type: Action
deprecated: true
definition: The act of adding data to the Asset.

Action
type: NamedIndividual
type: Collection
member: Action
member: Has Action
member: Implies
member: Included In
scope note: ODRL Core Vocabulary Terms

Actions for Rules
type: NamedIndividual
type: Collection
member: Transfer Ownership
member: Use
scope note: ODRL Core Vocabulary Terms

Actions for Rules
type: NamedIndividual
type: Collection
member: Attribution
member: Commercial Use
member: Derivative Works
member: Distribution
member: Notice
member: Reproduction
member: Share Alike
member: Sharing
member: Source Code
member: Accept Tracking
member: Aggregate
member: Annotate
member: Anonymize
member: Archive
member: Attribute
member: Compensate
member: Concurrent Use
member: Delete
member: Derive
member: Digitize
member: Display
member: Distribute
member: Ensure Exclusivity
member: Execute
member: Extract
member: Give
member: Grant Use
member: Include
member: Index
member: Inform
member: Install
member: Modify
member: Move
member: Next Policy
member: Obtain Consent
member: Play
member: Present
member: Print
member: Read
member: Reproduce
member: Review Policy
member: Sell
member: Stream
member: Synchronize
member: Text-to-speech
member: Transform
member: Translate
member: Uninstall
member: Watermark
scope note: ODRL Common Vocabulary Terms

Asset
type: NamedIndividual
type: Collection
member: Asset
member: Asset Collection
scope note: ODRL Core Vocabulary Terms

Asset and Party
type: NamedIndividual
type: Collection
member: Part Of
member: Source
scope note: ODRL Core Vocabulary Terms

Asset Relations
type: NamedIndividual
type: Collection
member: Target Policy
member: Target
scope note: ODRL Core Vocabulary Terms

Asset Relations
type: NamedIndividual
type: Collection
member: Output
scope note: ODRL Common Vocabulary Terms

Policy Conflict Strategy
type: NamedIndividual
type: Collection
member: Conflict Strategy Preference
member: Handle Policy Conflicts
member: Void Policy
member: Prefer Permissions
member: Prefer Prohibitions
scope note: ODRL Core Vocabulary Terms

Constraint Left Operands
type: NamedIndividual
type: Collection
member: Absolute Asset Position
member: Absolute Asset Size
member: Absolute Spatial Asset Position
member: Absolute Temporal Asset Position
member: Count
member: Datetime
member: Delay Period
member: Delivery Channel
member: Elapsed Time
member: Event
member: File Format
member: Industry Context
member: Language
member: Media Context
member: Metered Time
member: Payment Amount
member: Asset Percentage
member: Product Context
member: Purpose
member: Recipient
member: Relative Asset Position
member: Relative Asset Size
member: Relative Spatial Asset Position
member: Relative Temporal Asset Position
member: Rendition Resolution
member: Geospatial Named Area
member: Geospatial Coordinates
member: System Device
member: Recurring Time Interval
member: Unit Of Count
member: Version
member: Virtual IT Communication Location
scope note: ODRL Common Vocabulary Terms

Logical Constraint Operands
type: NamedIndividual
type: Collection
member: And
member: And Sequence
member: Or
member: Only One
scope note: ODRL Core Vocabulary Terms

Constraint Operators
type: NamedIndividual
type: Collection
member: Equal to
member: Greater than
member: Greater than or equal to
member: Has part
member: Is a
member: Is all of
member: Is any of
member: Is none of
member: Is part of
member: Less than
member: Less than or equal to
member: Not equal to
scope note: ODRL Core Vocabulary Terms

Constraint Right Operands
type: NamedIndividual
type: Collection
member: Policy Rule Usage
scope note: ODRL Common Vocabulary Terms

Constraint
type: NamedIndividual
type: Collection
member: Constraint
member: Left Operand
member: Operator
member: Right Operand
member: Has Constraint
member: Datatype
member: Has Left Operand
member: Has Operator
member: Refinement
member: Has Right Operand
member: Has Right Operand Reference
member: Status
member: unit
scope note: ODRL Core Vocabulary Terms

Deprecated Terms
type: NamedIndividual
type: Collection
member: All
member: All Second-level Connections
member: All First-Level Connections
member: All Group Connections
member: Asset Scope
member: Group
member: Individual
member: Party Scope
member: Undefined Term
member: Ad-hoc sharing
member: Append
member: Append To
member: Attach policy
member: Attach source
member: Commercialize
member: Copy
member: Device
member: Export
member: Extract character
member: Extract page
member: Extract word
member: Ignore Undefined Actions
member: Inheritance Allowed
member: Inherit Relation
member: Lease
member: Lend
member: License
member: Pay
member: Payee Party
member: Preview
member: proximity
member: Scope
member: Secondary Use
member: Share
member: Share-alike
member: Support Undefined Actions
member: System
member: Timed Count
member: Handle Undefined Term
member: Write
member: Write to

Duty
type: NamedIndividual
type: Collection
member: Duty
member: Consequence
member: Has Duty
member: Obligation
member: Remedy
scope note: ODRL Core Vocabulary Terms

Logical Constraint
type: NamedIndividual
type: Collection
member: Logical Constraint
member: Operand
scope note: ODRL Core Vocabulary Terms

Party
type: NamedIndividual
type: Collection
member: Party
member: Party Collection
scope note: ODRL Core Vocabulary Terms

Party Functions
type: NamedIndividual
type: Collection
member: Assignee
member: Assignee Of
member: Assigner
member: Assigner Of
scope note: ODRL Core Vocabulary Terms

Party Functions
type: NamedIndividual
type: Collection
member: Attributed Party
member: Attributing Party
member: Compensated Party
member: Compensating Party
member: Consented Party
member: Consenting Party
member: Contracted Party
member: Contracting Party
member: Informed Party
member: Informing Party
member: Tracked Party
member: Tracking Party
scope note: ODRL Common Vocabulary Terms

Permission
type: NamedIndividual
type: Collection
member: Permission
member: Has Permission
scope note: ODRL Core Vocabulary Terms

Policy
type: NamedIndividual
type: Collection
member: Policy
member: Inherits From
member: Profile
member: Unique Identifier
scope note: ODRL Core Vocabulary Terms

Policy Subclasses
type: NamedIndividual
type: Collection
member: Agreement
member: Offer
member: Set
scope note: ODRL Core Vocabulary Terms

Policy Subclasses
type: NamedIndividual
type: Collection
member: Assertion
member: Privacy Policy
member: Request
member: Ticket
scope note: ODRL Common Vocabulary Terms

Prohibition
type: NamedIndividual
type: Collection
member: Prohibition
member: Has Prohibition
scope note: ODRL Core Vocabulary Terms

Rule
type: NamedIndividual
type: Collection
member: Rule
member: Failure
member: Function
member: Relation
scope note: ODRL Core Vocabulary Terms

actionApplication
type: NamedIndividual
comment: An application that can complete the request.

actionOption
type: NamedIndividual
comment: A sub property of object. The options subject to this action.

actor
type: NamedIndividual
comment: An actor (individual or a group), e.g. in TV, radio, movie, video games etc., or in an event. Actors can be associated with individual items or with a series, episode, clip.

actors
type: NamedIndividual
supersededBy: actor
comment: An actor, e.g. in TV, radio, movie, video games etc. Actors can be associated with individual items or with a series, episode, clip.

album
type: NamedIndividual
comment: A music album.

albums
type: NamedIndividual
supersededBy: album
comment: A collection of music albums.

application
type: NamedIndividual
supersededBy: actionApplication
comment: An application that can complete the request.

area
type: NamedIndividual
supersededBy: serviceArea
comment: The area within which users can expect to reach the broadcast service.

areaServed
type: NamedIndividual
comment: The geographic area where a service or offered item is provided.

arterialBranch
type: NamedIndividual
comment: The branches that comprise the arterial structure.

artworkSurface
type: NamedIndividual
comment: The supporting materials for the artwork, e.g. Canvas, Paper, Wood, Board, etc.

aspect
type: NamedIndividual
supersededBy: mainContentOfPage
comment: An aspect of medical practice that is considered on the page, such as 'diagnosis', 'treatment', 'causes', 'prognosis', 'etiology', 'epidemiology', etc.

assembly
type: NamedIndividual
supersededBy: executableLibraryName
comment: Library file name, e.g., mscorlib.dll, system.web.dll.

attendee
type: NamedIndividual
comment: A person or organization attending the event.

attendees
type: NamedIndividual
supersededBy: attendee
comment: A person attending the event.

audience
type: NamedIndividual
comment: An intended audience, i.e. a group for whom something was created.

availableOnDevice
type: NamedIndividual
comment: Device required to run the application. Used in cases where a specific make/model is required to run the application.

award
type: NamedIndividual
comment: An award won by or for this item.

awards
type: NamedIndividual
supersededBy: award
comment: Awards won by or for this item.

benefits
type: NamedIndividual
supersededBy: jobBenefits
comment: Description of benefits associated with the job.

blogPost
type: NamedIndividual
comment: A posting that is part of this blog.

blogPosts
type: NamedIndividual
supersededBy: blogPost
comment: Indicates a post that is part of a Blog. Note that historically, what we term a "Blog" was once known as a "weblog", and that what we term a "BlogPosting" is now often colloquially referred to as a "blog".

bookingAgent
type: NamedIndividual
supersededBy: broker
comment: 'bookingAgent' is an out-dated term indicating a 'broker' that serves as a booking agent.

branch
type: NamedIndividual
supersededBy: arterialBranch
comment: The branches that delineate from the nerve bundle. Not to be confused with branchOf.

branchOf
type: NamedIndividual
supersededBy: parentOrganization
comment: The larger organization that this local business is a branch of, if any. Not to be confused with (anatomical) branch.

broker
type: NamedIndividual
comment: An entity that arranges for an exchange between a buyer and a seller. In most cases a broker never acquires or releases ownership of a product or service involved in an exchange. If it is not clear whether an entity is a broker, seller, or buyer, the latter two terms are preferred.

carrier
type: NamedIndividual
supersededBy: provider
comment: 'carrier' is an out-dated term indicating the 'provider' for parcel delivery and flights.

catalog
type: NamedIndividual
supersededBy: includedInDataCatalog
comment: A data catalog which contains this dataset.

clincalPharmacology
type: NamedIndividual
supersededBy: clinicalPharmacology
comment: Description of the absorption and elimination of drugs, including their concentration (pharmacokinetics, pK) and biological effects (pharmacodynamics, pD).

clinicalPharmacology
type: NamedIndividual
comment: Description of the absorption and elimination of drugs, including their concentration (pharmacokinetics, pK) and biological effects (pharmacodynamics, pD).

codeSampleType
type: NamedIndividual
comment: What type of code sample: full (compile ready) solution, code snippet, inline code, scripts, template.

colleague
type: NamedIndividual
comment: A colleague of the person.

colleagues
type: NamedIndividual
supersededBy: colleague
comment: A colleague of the person.

collection
type: NamedIndividual
supersededBy: targetCollection
comment: A sub property of object. The collection target of the action.

contactPoint
type: NamedIndividual
comment: A contact point for a person or organization.

contactPoints
type: NamedIndividual
supersededBy: contactPoint
comment: A contact point for a person or organization.

containedIn
type: NamedIndividual
supersededBy: containedInPlace
comment: The basic containment relation between a place and one that contains it.

containedInPlace
type: NamedIndividual
comment: The basic containment relation between a place and one that contains it.

containsSeason
type: NamedIndividual
comment: A season that is part of the media series.

course
type: NamedIndividual
supersededBy: exerciseCourse
comment: A sub property of location. The course where this action was taken.

datasetTimeInterval
type: NamedIndividual
supersededBy: temporalCoverage
comment: The range of temporal applicability of a dataset, e.g. for a 2011 census dataset, the year 2011 (in ISO 8601 time interval format).

device
type: NamedIndividual
supersededBy: availableOnDevice
comment: Device required to run the application. Used in cases where a specific make/model is required to run the application.

director
type: NamedIndividual
comment: A director of e.g. TV, radio, movie, video gaming etc. content, or of an event. Directors can be associated with individual items or with a series, episode, clip.

directors
type: NamedIndividual
supersededBy: director
comment: A director of e.g. TV, radio, movie, video games etc. content. Directors can be associated with individual items or with a series, episode, clip.

employee
type: NamedIndividual
comment: Someone working for this organization.

employees
type: NamedIndividual
supersededBy: employee
comment: People working for this organization.

encoding
type: NamedIndividual
comment: A media object that encodes this CreativeWork. This property is a synonym for associatedMedia.

encodingFormat
type: NamedIndividual
comment: Media type typically expressed using a MIME format (see IANA site and MDN reference), e.g. application/zip for a SoftwareApplication binary, audio/mpeg for .mp3 etc. In cases where a CreativeWork has several media type representations, encoding can be used to indicate each MediaObject alongside particular encodingFormat information. Unregistered or niche encoding and file formats can be indicated instead via the most appropriate URL, e.g. defining Web page or a Wikipedia/Wikidata entry.

encodings
type: NamedIndividual
supersededBy: encoding
comment: A media object that encodes this CreativeWork.

episode
type: NamedIndividual
comment: An episode of a TV, radio or game media within a series or season.

episodes
type: NamedIndividual
supersededBy: episode
comment: An episode of a TV/radio series or season.

event
type: NamedIndividual
comment: Upcoming or past event associated with this place, organization, or action.

events
type: NamedIndividual
supersededBy: event
comment: Upcoming or past events associated with this place or organization.

executableLibraryName
type: NamedIndividual
comment: Library file name, e.g., mscorlib.dll, system.web.dll.

exerciseCourse
type: NamedIndividual
comment: A sub property of location. The course where this action was taken.

fileFormat
type: NamedIndividual
supersededBy: encodingFormat
comment: Media type, typically MIME format (see IANA site) of the content, e.g. application/zip of a SoftwareApplication binary. In cases where a CreativeWork has several media type representations, 'encoding' can be used to indicate each MediaObject alongside particular fileFormat information. Unregistered or niche file formats can be indicated instead via the most appropriate URL, e.g. defining Web page or a Wikipedia entry.

founder
type: NamedIndividual
comment: A person or organization who founded this organization.

founders
type: NamedIndividual
supersededBy: founder
comment: A person who founded this organization.

free
type: NamedIndividual
supersededBy: isAccessibleForFree
comment: A flag to signal that the item, event, or place is accessible for free.

hasMap
type: NamedIndividual
comment: A URL to a map of the place.

hasMenu
type: NamedIndividual
comment: Either the actual menu as a structured representation, as text, or a URL of the menu.

hasMerchantReturnPolicy
type: NamedIndividual
comment: Specifies a MerchantReturnPolicy that may be applicable.

hasProductReturnPolicy
type: NamedIndividual
supersededBy: hasMerchantReturnPolicy
comment: Indicates a ProductReturnPolicy that may be applicable.

inLanguage
type: NamedIndividual
comment: The language of the content or performance or used in an action. Please use one of the language codes from the IETF BCP 47 standard. See also availableLanguage.

incentiveCompensation
type: NamedIndividual
comment: Description of bonus and commission compensation aspects of the job.

incentives
type: NamedIndividual
supersededBy: incentiveCompensation
comment: Description of bonus and commission compensation aspects of the job.

includedDataCatalog
type: NamedIndividual
supersededBy: includedInDataCatalog
comment: A data catalog which contains this dataset (this property was previously 'catalog', preferred name is now 'includedInDataCatalog').

includedInDataCatalog
type: NamedIndividual
comment: A data catalog which contains this dataset.

ingredients
type: NamedIndividual
supersededBy: recipeIngredient
comment: A single ingredient used in the recipe, e.g. sugar, flour or garlic.

interactionCount
type: NamedIndividual
supersededBy: interactionStatistic
comment: This property is deprecated, alongside the UserInteraction types on which it depended.

interactionStatistic
type: NamedIndividual
comment: The number of interactions for the CreativeWork using the WebSite or SoftwareApplication. The most specific child type of InteractionCounter should be used.

isAccessibleForFree
type: NamedIndividual
comment: A flag to signal that the item, event, or place is accessible for free.

isBasedOn
type: NamedIndividual
comment: A resource from which this work is derived or from which it is a modification or adaptation.

isBasedOnUrl
type: NamedIndividual
supersededBy: isBasedOn
comment: A resource that was used in the creation of this resource. This term can be repeated for multiple sources. For example, http://example.com/great-multiplication-intro.html.

jobBenefits
type: NamedIndividual
comment: Description of benefits associated with the job.

language
type: NamedIndividual
supersededBy: inLanguage
comment: A sub property of instrument. The language used on this action.

mainContentOfPage
type: NamedIndividual
comment: Indicates if this web page element is the main subject of the page.

map
type: NamedIndividual
supersededBy: hasMap
comment: A URL to a map of the place.

maps
type: NamedIndividual
supersededBy: hasMap
comment: A URL to a map of the place.

member
type: NamedIndividual
comment: A member of an Organization or a ProgramMembership. Organizations can be members of organizations; ProgramMembership is typically for individuals.

members
type: NamedIndividual
supersededBy: member
comment: A member of this organization.

menu
type: NamedIndividual
supersededBy: hasMenu
comment: Either the actual menu as a structured representation, as text, or a URL of the menu.

merchant
type: NamedIndividual
supersededBy: seller
comment: 'merchant' is an out-dated term for 'seller'.

merchantReturnDays
type: NamedIndividual
comment: Specifies either a fixed return date or the number of days (from the delivery date) that a product can be returned. Used when the returnPolicyCategory property is specified as MerchantReturnFiniteReturnWindow.

merchantReturnLink
type: NamedIndividual
comment: Specifies a Web page or service by URL, for product returns.

musicGroupMember
type: NamedIndividual
supersededBy: member
comment: A member of a music group—for example, John, Paul, George, or Ringo.

namedPosition
type: NamedIndividual
supersededBy: roleName
comment: A position played, performed or filled by a person or organization, as part of an organization. For example, an athlete in a SportsTeam might play in the position named 'Quarterback'.

option
type: NamedIndividual
supersededBy: actionOption
comment: A sub property of object. The options subject to this action.

parent
type: NamedIndividual
comment: A parent of this person.

parentOrganization
type: NamedIndividual
comment: The larger organization that this organization is a subOrganization of, if any.

parents
type: NamedIndividual
supersededBy: parent
comment: A parents of the person.

partOfSeries
type: NamedIndividual
comment: The series to which this episode or season belongs.

partOfTVSeries
type: NamedIndividual
supersededBy: partOfSeries
comment: The TV series to which this episode or season belongs.

paymentDue
type: NamedIndividual
supersededBy: paymentDueDate
comment: The date that payment is due.

paymentDueDate
type: NamedIndividual
comment: The date that payment is due.

performer
type: NamedIndividual
comment: A performer at the event—for example, a presenter, musician, musical group or actor.

performers
type: NamedIndividual
supersededBy: performer
comment: The main performer or performers of the event—for example, a presenter, musician, or actor.

photo
type: NamedIndividual
comment: A photograph of this place.

photos
type: NamedIndividual
supersededBy: photo
comment: Photographs of this place.

produces
type: NamedIndividual
supersededBy: serviceOutput
comment: The tangible thing generated by the service, e.g. a passport, permit, etc.

productReturnDays
type: NamedIndividual
supersededBy: merchantReturnDays
comment: The productReturnDays property indicates the number of days (from purchase) within which relevant product return policy is applicable.

productReturnLink
type: NamedIndividual
supersededBy: merchantReturnLink
comment: Indicates a Web page or service by URL, for product return.

provider
type: NamedIndividual
comment: The service provider, service operator, or service performer; the goods producer. Another party (a seller) may offer those services or goods on behalf of the provider. A provider may also serve as the seller.

recipeIngredient
type: NamedIndividual
comment: A single ingredient used in the recipe, e.g. sugar, flour or garlic.

requirements
type: NamedIndividual
supersededBy: softwareRequirements
comment: Component dependency requirements for application. This includes runtime environments and shared libraries that are not included in the application distribution package, but required to run the application (examples: DirectX, Java or .NET runtime).

review
type: NamedIndividual
comment: A review of the item.

reviews
type: NamedIndividual
supersededBy: review
comment: Review of the item.

runtime
type: NamedIndividual
supersededBy: runtimePlatform
comment: Runtime platform or script interpreter dependencies (example: Java v1, Python 2.3, .NET Framework 3.0).

runtimePlatform
type: NamedIndividual
comment: Runtime platform or script interpreter dependencies (example: Java v1, Python 2.3, .NET Framework 3.0).

sampleType
type: NamedIndividual
supersededBy: codeSampleType
comment: What type of code sample: full (compile ready) solution, code snippet, inline code, scripts, template.

season
type: NamedIndividual
supersededBy: containsSeason
comment: A season in a media series.

seasons
type: NamedIndividual
supersededBy: season
comment: A season in a media series.

seller
type: NamedIndividual
comment: An entity which offers (sells / leases / lends / loans) the services / goods. A seller may also be a provider.

serviceArea
type: NamedIndividual
supersededBy: areaServed
comment: The geographic area where the service is provided.

serviceAudience
type: NamedIndividual
supersededBy: audience
comment: The audience eligible for this service.

serviceOutput
type: NamedIndividual
comment: The tangible thing generated by the service, e.g. a passport, permit, etc.

sibling
type: NamedIndividual
comment: A sibling of the person.

siblings
type: NamedIndividual
supersededBy: sibling
comment: A sibling of the person.

significantLink
type: NamedIndividual
comment: One of the more significant URLs on the page. Typically, these are the non-navigation links that are clicked on the most.

significantLinks
type: NamedIndividual
supersededBy: significantLink
comment: The most significant URLs on the page. Typically, these are the non-navigation links that are clicked on the most.

softwareRequirements
type: NamedIndividual
comment: Component dependency requirements for application. This includes runtime environments and shared libraries that are not included in the application distribution package, but required to run the application (examples: DirectX, Java or .NET runtime).

step
type: NamedIndividual
comment: A single step item (as HowToStep, text, document, video, etc.) or a HowToSection.

steps
type: NamedIndividual
supersededBy: step
comment: A single step item (as HowToStep, text, document, video, etc.) or a HowToSection (originally misnamed 'steps'; 'step' is preferred).

subEvent
type: NamedIndividual
comment: An Event that is part of this event. For example, a conference event includes many presentations, each of which is a subEvent of the conference.

subEvents
type: NamedIndividual
supersededBy: subEvent
comment: Events that are a part of this event. For example, a conference event includes many presentations, each subEvents of the conference.

surface
type: NamedIndividual
supersededBy: artworkSurface
comment: A material used as a surface in some artwork, e.g. Canvas, Paper, Wood, Board, etc.

targetCollection
type: NamedIndividual
comment: A sub property of object. The collection target of the action.

temporalCoverage
type: NamedIndividual
comment: The temporalCoverage of a CreativeWork indicates the period that the content applies to, i.e. that it describes, either as a DateTime or as a textual string indicating a time period in ISO 8601 time interval format. In the case of a Dataset it will typically indicate the relevant time period in a precise notation (e.g. for a 2011 census dataset, the year 2011 would be written "2011/2012"). Other forms of content, e.g. ScholarlyArticle, Book, TVSeries or TVEpisode, may indicate their temporalCoverage in broader terms - textually or via well-known URL. Written works such as books may sometimes have precise temporal coverage too, e.g. a work set in 1939 - 1945 can be indicated in ISO 8601 interval format format via "1939/1945". Open-ended date ranges can be written with ".." in place of the end date. For example, "2015-11/.." indicates a range beginning in November 2015 and with no specified final date. This is tentative and might be updated in future when ISO 8601 is officially updated.

track
type: NamedIndividual
comment: A music recording (track)—usually a single song. If an ItemList is given, the list should contain items of type MusicRecording.

tracks
type: NamedIndividual
supersededBy: track
comment: A music recording (track)—usually a single song.

vendor
type: NamedIndividual
supersededBy: seller
comment: 'vendor' is an earlier term for 'seller'.

warranty
type: NamedIndividual
comment: The warranty promise(s) included in the offer.

warrantyPromise
type: NamedIndividual
supersededBy: warranty
comment: The warranty promise(s) included in the offer.